titanium oxide
- Formula: OTi
- Molecular weight: 63.866
- IUPAC Standard InChIKey: OGIDPMRJRNCKJF-UHFFFAOYSA-N
- CAS Registry Number: 12137-20-1
- Chemical structure:
View 3d structure (requires JavaScript / HTML 5) - Other names: Titanium monoxide

Gas phase thermochemistry data

Quantity | Value | Units | Method | Reference | Comment |
---|---|---|---|---|---|
ΔfH°gas | 54.39 | kJ/mol | Review | Chase, 1998 | Data last reviewed in December, 1973 |
Quantity | Value | Units | Method | Reference | Comment |
S°gas,1 bar | 233.46 | J/mol*K | Review | Chase, 1998 | Data last reviewed in December, 1973 |
Gas Phase Heat Capacity (Shomate Equation)
Cp° = A + B*t + C*t2 + D*t3 +
E/t2
H° − H°298.15= A*t + B*t2/2 +
C*t3/3 + D*t4/4 − E/t + F − H
S° = A*ln(t) + B*t + C*t2/2 + D*t3/3 −
E/(2*t2) + G
Cp = heat capacity (J/mol*K)
H° = standard enthalpy (kJ/mol)
S° = standard entropy (J/mol*K)
t = temperature (K) / 1000.
View plot Requires a JavaScript / HTML 5 canvas capable browser.
Temperature (K) | 4500. to 6000. |
---|---|
A | 36.25740 |
B | -2.704541 |
C | 1.691450 |
D | -0.151753 |
E | 9.805701 |
F | 51.83580 |
G | 281.4380 |
H | 54.39200 |
Reference | Chase, 1998 |
Comment | Data last reviewed in December, 1973 |

Condensed phase thermochemistry data

Quantity | Value | Units | Method | Reference | Comment |
---|---|---|---|---|---|
ΔfH°liquid | -118.05 | kcal/mol | Review | Chase, 1998 | Data last reviewed in December, 1973 |
Quantity | Value | Units | Method | Reference | Comment |
S°liquid,1 bar | 14.37 | cal/mol*K | Review | Chase, 1998 | Data last reviewed in December, 1973 |
Quantity | Value | Units | Method | Reference | Comment |
ΔfH°solid | -129.70 | kcal/mol | Review | Chase, 1998 | α phase; Data last reviewed in December, 1973 |
Liquid Phase Heat Capacity (Shomate Equation)
Cp° = A + B*t + C*t2 + D*t3 +
E/t2
H° − H°298.15= A*t + B*t2/2 +
C*t3/3 + D*t4/4 − E/t + F − H
S° = A*ln(t) + B*t + C*t2/2 + D*t3/3 −
E/(2*t2) + G
Cp = heat capacity (cal/mol*K)
H° = standard enthalpy (kcal/mol)
S° = standard entropy (cal/mol*K)
t = temperature (K) / 1000.
View plot Requires a JavaScript / HTML 5 canvas capable browser.
Temperature (K) | 2023. to 4500. |
---|---|
A | 15.99998 |
B | 0.000009 |
C | -0.000002 |
D | 1.655581×10-7 |
E | 0.000012 |
F | -125.7326 |
G | 28.42973 |
H | -118.0543 |
Reference | Chase, 1998 |
Comment | Data last reviewed in December, 1973 |
Solid Phase Heat Capacity (Shomate Equation)
Cp° = A + B*t + C*t2 + D*t3 +
E/t2
H° − H°298.15= A*t + B*t2/2 +
C*t3/3 + D*t4/4 − E/t + F − H
S° = A*ln(t) + B*t + C*t2/2 + D*t3/3 −
E/(2*t2) + G
Cp = heat capacity (cal/mol*K)
H° = standard enthalpy (kcal/mol)
S° = standard entropy (cal/mol*K)
t = temperature (K) / 1000.
View plot Requires a JavaScript / HTML 5 canvas capable browser.
Temperature (K) | 298. to 2023. | 298. to 2023. |
---|---|---|
A | 9.987591 | 9.983160 |
B | 4.360761 | 4.370510 |
C | -0.089081 | -0.095437 |
D | 0.015586 | 0.016853 |
E | -0.154094 | -0.153905 |
F | -133.3890 | -132.3870 |
G | 18.23110 | 19.01460 |
H | -129.7000 | -128.7000 |
Reference | Chase, 1998 | Chase, 1998 |
Comment | α phase; Data last reviewed in December, 1973 | β phase; Data last reviewed in December, 1973 |

Gas phase ion energetics data

Data evaluated as indicated in comments:
L - Sharon G. Lias
Data compiled as indicated in comments:
LL - Sharon G. Lias and Joel F. Liebman
LBLHLM - Sharon G. Lias, John E. Bartmess, Joel F. Liebman, John L. Holmes, Rhoda D. Levin, and W. Gary Mallard
LLK - Sharon G. Lias, Rhoda D. Levin, and Sherif A. Kafafi
RDSH - Henry M. Rosenstock, Keith Draxl, Bruce W. Steiner, and John T. Herron
B - John E. Bartmess
Quantity | Value | Units | Method | Reference | Comment |
---|---|---|---|---|---|
IE (evaluated) | 6.819 ± 0.006 | eV | N/A | N/A | L |
Electron affinity determinations
EA (eV) | Method | Reference | Comment |
---|---|---|---|
1.200 ± 0.010 | N/A | Peppernick, Gunaratne, et al., 2010 | B |
1.300 ± 0.030 | LPES | Wu and Wang, 1997 | B |
Ionization energy determinations
IE (eV) | Method | Reference | Comment |
---|---|---|---|
6.819 ± 0.006 | LS | Sappey, Eiden, et al., 1989 | LL |
6.7 ± 0.5 | EI | Balducci, Gigli, et al., 1985 | LBLHLM |
6.5 ± 0.5 | EI | Balducci, Gigli, et al., 1985, 2 | LBLHLM |
6.56 ± 0.03 | PE | Dyke, Gravenor, et al., 1984 | LBLHLM |
6.8 ± 0.5 | EI | Banon, Chatillon, et al., 1982 | LBLHLM |
6.5 ± 0.3 | EI | Murad and Hildenbrand, 1980 | LLK |
6.7 | EI | Hildenbrand, 1977 | LLK |
6.8 ± 0.5 | EI | Smoes, Drowart, et al., 1976 | LLK |
6.7 ± 0.1 | EI | Hildenbrand, 1976 | LLK |
6.4 ± 0.1 | EI | Rauh and Ackermann, 1974 | LLK |
7.22 ± 0.35 | EI | Wu and Wahlbeck, 1972 | LLK |
7.3 ± 0.5 | EI | Balducci, De Maria, et al., 1972 | LLK |
6.8 ± 0.5 | EI | Edwards, Franzen, et al., 1971 | LLK |
5.5 ± 0.5 | EI | Mesnard, Uzan, et al., 1966 | RDSH |
6.82 ± 0.02 | PE | Dyke, Gravenor, et al., 1984 | Vertical value; LBLHLM |
Appearance energy determinations
Ion | AE (eV) | Other Products | Method | Reference | Comment |
---|---|---|---|---|---|
Ti+ | 12.8 ± 0.4 | O | EI | Banon, Chatillon, et al., 1982 | LBLHLM |
Ti+ | 14.51 ± 0.36 | O | EI | Wu and Wahlbeck, 1972 | LLK |
Ti+ | 14.5 ± 0.7 | ? | EI | Balducci, De Maria, et al., 1972 | LLK |
Ti+ | 11.5 ± 0.2 | O | EI | Mesnard, Uzan, et al., 1966 | RDSH |

References

Chase, 1998
Chase, M.W., Jr.,
NIST-JANAF Themochemical Tables, Fourth Edition,
J. Phys. Chem. Ref. Data, Monograph 9, 1998, 1-1951. [all data]