Vanillic acid

Van Den Dool and Kratz RI, non-polar column, temperature ramp

View large format table.

Column type Active phase I Reference Comment
CapillaryDB-51592.Alves, Pinto, et al., 200530. m/0.25 mm/0.25 μm, H2, 5. K/min, 270. C @ 20. min; Tstart: 35. C

Normal alkane RI, non-polar column, temperature ramp

View large format table.

Column type Active phase I Reference Comment
CapillaryHP-5 MS1566.Jerkovic, Hegic, et al., 201030. m/0.25 mm/0.25 μm, Helium, 70. C @ 2. min, 3. K/min, 200. C @ 18. min
CapillaryHP-5 MS1566.Jerkovic and Marijanovic, 201030. m/0.25 mm/0.25 μm, Helium, 70. C @ 2. min, 3. K/min, 200. C @ 18. min
CapillaryOptima 11620.Fons, Rapior, et al., 199825. m/0.20 mm/0.25 μm, Helium, 3. K/min; Tstart: 50. C; Tend: 200. C
CapillaryDB-51570.Güntert, Rapp, et al., 198630. m/0.25 mm/0.25 μm, He, 2. K/min; Tstart: 40. C; Tend: 250. C

Normal alkane RI, non-polar column, custom temperature program

View large format table.

Column type Active phase I Reference Comment
CapillaryHP-5MS1608.Alissandrakis, Kibaris, et al., 200530. m/0.25 mm/0.25 μm, He; Program: 40C(3min) => 2C/min => 180C => 10C/min => 250C(5min)

References

Alves, Pinto, et al., 2005
Alves, R.J.V.; Pinto, A.C.; da Costa, A.V.M.; Rezende, C.M., Zizyphus mauritiana Lam. (Rhamnaceae) and the chemical composition of its floral fecal odor, J. Braz. Chem. Soc., 2005, 16, 3B, 654-656, https://doi.org/10.1590/S0103-50532005000400027 . [all data]

Jerkovic, Hegic, et al., 2010
Jerkovic, I.; Hegic, G.; Marijanovic, Z.; Bubalo, D., Organic extractives from Mentha spp. honey and the bee-stomach: methyl syringate, vomifoliol, terpenediol I, hotrienol, and other compounds, Molecules, 2010, 15, 4, 2911-2924, https://doi.org/10.3390/molecules15042911 . [all data]

Jerkovic and Marijanovic, 2010
Jerkovic, I.; Marijanovic, Z., Oak (Quercus frainetto Ten.) honeydaw honey - approach to screening of volatile organic composition and antioxidant capacity (DPPH and FRAP assay), Molecules, 2010, 15, 5, 3744-3756, https://doi.org/10.3390/molecules15053744 . [all data]

Fons, Rapior, et al., 1998
Fons, F.; Rapior, S.; Gargadennec, A.; Andary, C.; Bessiere, J.-M., Volatile components of Plantago lanceolata (Plantaginaceae), Acta bot. Gallica, 1998, 145, 4, 265-269, https://doi.org/10.1080/12538078.1998.10516306 . [all data]

Güntert, Rapp, et al., 1986
Güntert, M.; Rapp, A.; Takeoka, G.R.; Jennings, W., HRGC and HRGC-MS applied to wine constituents of lower volatility, Z. Lebensm. Unters. Forsch., 1986, 182, 3, 200-204, https://doi.org/10.1007/BF01042128 . [all data]

Alissandrakis, Kibaris, et al., 2005
Alissandrakis, E.; Kibaris, A.C.; Tarantilis, P.A.; Harizanis, P.C.; Polissiou, M., Flavour compounds of Greek cotton honey, J. Sci. Food Agric., 2005, 85, 9, 1444-1452, https://doi.org/10.1002/jsfa.2124 . [all data]