ammonium bromide
- Formula: BrH4N
- Molecular weight: 97.942
- IUPAC Standard InChIKey: SWLVFNYSXGMGBS-UHFFFAOYSA-N
- CAS Registry Number: 12124-97-9
- Chemical structure:

Phase change data

Data compiled as indicated in comments:
AC - William E. Acree, Jr., James S. Chickos
Quantity | Value | Units | Method | Reference | Comment |
---|---|---|---|---|---|
ΔsubH° | 187.9 | kJ/mol | N/A | Luft, 1955 | AC |
Antoine Equation Parameters
log10(P) = A − (B / (T + C))
P = vapor pressure (bar)
T = temperature (K)
View plot Requires a JavaScript / HTML 5 canvas capable browser.
Temperature (K) | A | B | C | Reference | Comment |
---|---|---|---|---|---|
471.5 to 669. | 6.66591 | 4382.314 | -12.045 | Stull, 1947 | Coefficents calculated by NIST from author's data. |
Enthalpy of sublimation
ΔsubH (kJ/mol) | Temperature (K) | Method | Reference | Comment |
---|---|---|---|---|
183.7 | 550. | I | Callanan and Smith, 1971 | AC |

Gas phase ion energetics data

Data compiled by: John E. Bartmess
Electron affinity determinations
EA (eV) | Method | Reference | Comment |
---|---|---|---|
0.670 ± 0.050 | LPES | Eustis, Whiteside, et al., 2010 |

Condensed phase thermochemistry data

Quantity Value Units Method Reference Comment
Δfsolid-271.54kJ/molReviewChase, 1998Data last reviewed in September, 1965
Quantity Value Units Method Reference Comment
solid112.81J/mol*KReviewChase, 1998Data last reviewed in September, 1965

Solid Phase Heat Capacity (Shomate Equation)

Cp° = A + B*t + C*t2 + D*t3 + E/t2
H° − H°298.15= A*t + B*t2/2 + C*t3/3 + D*t4/4 − E/t + F − H
S° = A*ln(t) + B*t + C*t2/2 + D*t3/3 − E/(2*t2) + G
    Cp = heat capacity (J/mol*K)
    H° = standard enthalpy (kJ/mol)
    S° = standard entropy (J/mol*K)
    t = temperature (K) / 1000.

View plot Requires a JavaScript / HTML 5 canvas capable browser.

View table.

Temperature (K) 298. - 411.411. - 1500.
A 15.77418-12.56903
B 982.7672257.1403
C -3031.375-123.3636
D 2870.27425.03053
E -2.374655-0.206848
F -306.7922-272.3817
G -65.0955142.37179
H -271.5424-271.5424
ReferenceChase, 1998Chase, 1998
Comment Data last reviewed in September, 1965 Data last reviewed in September, 1965

References

Luft, 1955
Luft, N.W.,
Ind. Chemist, 1955, 31, 502. [all data]
Stull, 1947
Stull, Daniel R.,
Vapor Pressure of Pure Substances. Organic and Inorganic Compounds,
Ind. Eng. Chem., 1947, 39, 4, 517-540, https://doi.org/10.1021/ie50448a022
. [all data]
Callanan and Smith, 1971
Callanan, Jane E.; Smith, Norman O.,
Sublimation pressures of solid solutions III. NH4Cl + NH4Br,
The Journal of Chemical Thermodynamics, 1971, 3, 4, 531-538, https://doi.org/10.1016/S0021-9614(71)80036-8
. [all data]
Eustis, Whiteside, et al., 2010
Eustis, S.N.; Whiteside, A.; Wang, D.; Gutowski, M.; Bowen, K.H.,
Ammonia-Hydrogen Bromide and Ammonia-Hydrogen Iodide Complexes: Anion Photoelectron and ab Initio Studies,
J. Phys. Chem. A, 2010, 114, 3, 1357-1363, https://doi.org/10.1021/jp906238v
. [all data]