Benzene, 1-chloro-2-nitro-4-(trifluoromethyl)-
- Formula: C7H3ClF3NO2
- Molecular weight: 225.552
- IUPAC Standard InChIKey: TZGFQIXRVUHDLE-UHFFFAOYSA-N
- CAS Registry Number: 121-17-5
- Chemical structure:
View 3d structure (requires JavaScript / HTML 5) - Other names: Toluene, 4-chloro-α,α,α-trifluoro-3-nitro-; 2-Nitro-4-(trifluoromethyl)chlorobenzene; 3-Nitro-4-(chloro)trifluoromethylbenzene; 4-Chloro-α,α,α-trifluoro-3-nitrotoluene; 4-Chloro-3-nitro-1-(trifluoromethyl)benzene; 4-Chloro-3-nitrobenzotrifluoride; 4-Chloro-3-nitro-α,α,α-trifluorotoluene; 3-Nitro-4-chlorobenzotrifluoride; 2-Chloro-5-(trifluoromethyl)nitrobenzene; 4-Chloro-3-nitrobenzylidyne fluoride; Toluene, 4-chloro-3-nitro-α,α,α-trifluoro-; Benzotrifluoride, 4-chloro-3-nitro-; 3-Nitro-4-chloro-α,α,α-trifluorotoluene; UN 2307; (3-Nitro-4-chlorophenyl)trifluoromethane; 1-Chloro-4-trifluoromethyl-2-nitrobenzene; NSC 8760

Condensed phase thermochemistry data

Data compiled by: Hussein Y. Afeefy, Joel F. Liebman, and Stephen E. Stein
Quantity | Value | Units | Method | Reference | Comment |
---|---|---|---|---|---|
ΔfH°solid | -330.8 ± 0.92 | kJ/mol | Ccb | Gambaretto, Scipioni, et al., 1980 | |
Quantity | Value | Units | Method | Reference | Comment |
ΔcH°solid | -3229.5 ± 9.0 | kJ/mol | Ccb | Gambaretto, Scipioni, et al., 1980 |

Phase change data

Data compiled as indicated in comments:
BS - Robert L. Brown and Stephen E. Stein
AC - William E. Acree, Jr., James S. Chickos
Quantity | Value | Units | Method | Reference | Comment |
---|---|---|---|---|---|
Tboil | 495.2 | K | N/A | Weast and Grasselli, 1989 | BS |
Reduced pressure boiling point
Tboil (K) | Pressure (bar) | Reference | Comment |
---|---|---|---|
367. to 368. | 0.013 | PCR Inc., 1990 | BS |
Enthalpy of vaporization
ΔvapH (kJ/mol) | Temperature (K) | Method | Reference | Comment |
---|---|---|---|---|
57.6 | 373. | A | Stephenson and Malanowski, 1987 | Based on data from 358. to 495. K. See also Kkykj and Repas, 1973 and Dykyj, Svoboda, et al., 1999.; AC |

References

Gambaretto, Scipioni, et al., 1980
Gambaretto, G.; Scipioni, A.; Conte, L.,
Determination of the heats of formation and nitration of 3-nitro-4-chlorobenzotrifluoride and 3,5-dinitro-4-chlorobenzotrifluoride,
Atti - Ist. Veneto Sci., Lett. Arti, Cl. Sci. Fis., Mat. Nat., 1980, 138, 189-194. [all data]
Weast and Grasselli, 1989
CRC Handbook of Data on Organic Compounds, 2nd Editon, Weast,R.C and Grasselli, J.G., ed(s)., CRC Press, Inc., Boca Raton, FL, 1989, 1. [all data]
PCR Inc., 1990
PCR Inc.,
Research Chemicals Catalog 1990-1991, PCR Inc., Gainesville, FL, 1990, 1. [all data]
Stephenson and Malanowski, 1987
Stephenson, Richard M.; Malanowski, Stanislaw,
Handbook of the Thermodynamics of Organic Compounds, 1987, https://doi.org/10.1007/978-94-009-3173-2
. [all data]
Kkykj and Repas, 1973
Kkykj, J.; Repas, M.,
Petrochemia, 1973, 13, 179. [all data]
Dykyj, Svoboda, et al., 1999
Dykyj, J.; Svoboda, J.; Wilhoit, R.C.; Frenkel, M.L.; Hall, K.R.,
Vapor Pressure of Chemicals: Part A. Vapor Pressure and Antoine Constants for Hydrocarbons and Sulfur, Selenium, Tellurium and Hydrogen Containing Organic Compounds, Springer, Berlin, 1999, 373. [all data]