(2,2',4,6'-Tetrachloro-3-methyldiphenyl)methane
- Formula: C14H10Cl4
- Molecular weight: 320.041
- CAS Registry Number: 121107-47-9

Phase change data

Data compiled by: William E. Acree, Jr., James S. Chickos
Quantity | Value | Units | Method | Reference | Comment |
---|---|---|---|---|---|
ΔvapH° | 100.1 | kJ/mol | GC | van Haelst, van der Wielen, et al., 1996 |

References

van Haelst, van der Wielen, et al., 1996
van Haelst, Anniek G.; van der Wielen, Frans W.M.; Govers, Harrie A.J.,
Gas chromatographic determination of liquid vapour pressure and heat of vaporization of tetrachlorobenzyltoluenes,
Journal of Chromatography A, 1996, 727, 2, 265-273, https://doi.org/10.1016/0021-9673(95)01146-3
. [all data]