(2',3,4,6'-Tetrachloro-6-methyldiphenyl)methane

Phase change data

Data compiled by: William E. Acree, Jr., James S. Chickos

Quantity Value Units Method Reference Comment
Δvap101.1kJ/molGCvan Haelst, van der Wielen, et al., 1996
Δvap101.8kJ/molGCvan Haelst, van der Wielen, et al., 1996

References

van Haelst, van der Wielen, et al., 1996
van Haelst, Anniek G.; van der Wielen, Frans W.M.; Govers, Harrie A.J., Gas chromatographic determination of liquid vapour pressure and heat of vaporization of tetrachlorobenzyltoluenes, Journal of Chromatography A, 1996, 727, 2, 265-273, https://doi.org/10.1016/0021-9673(95)01146-3 . [all data]