Dibenzosuberone
- Formula: C15H12O
- Molecular weight: 208.2552
- IUPAC Standard InChIKey: BMVWCPGVLSILMU-UHFFFAOYSA-N
- CAS Registry Number: 1210-35-1
- Chemical structure:
View 3d structure (requires JavaScript / HTML 5) - Other names: 5H-Dibenzo[a,d]cyclohepten-5-one, 10,11-dihydro-; Dibenzosuberan-5-one; Dibenzo[a,d]cycloheptadien-5-one; Dibenzo[a,d]cyclohepta[1,4]dien-5-one; 10,11-Dihydrodibenzo[a,d]cyclohepten-5-one; 2,3:6,7-Dibenzosuberone; 10,11-Dihydro-5H-dibenzo(a,d)cyclohepten-5-one; 5-Dibenzosuberone; Dibenzocycloheptadienone; Dibenzocycloheptenone; NSC 49727; dibenzo(b,f)cycloheptan-1-one

Condensed phase thermochemistry data

Data compiled by: Hussein Y. Afeefy, Joel F. Liebman, and Stephen E. Stein
Quantity | Value | Units | Method | Reference | Comment |
---|---|---|---|---|---|
ΔfH°solid | -29.52 ± 0.81 | kcal/mol | Ccb | Perisanu, Banciu, et al., 1993 | |
Quantity | Value | Units | Method | Reference | Comment |
ΔcH°solid | -1791.60 ± 0.81 | kcal/mol | Ccb | Perisanu, Banciu, et al., 1993 | Corresponding ΔfHºsolid = -29.061 kcal/mol (simple calculation by NIST; no Washburn corrections) |

Phase change data

Data compiled as indicated in comments:
BS - Robert L. Brown and Stephen E. Stein
AC - William E. Acree, Jr., James S. Chickos
Quantity | Value | Units | Method | Reference | Comment |
---|---|---|---|---|---|
ΔsubH° | 26.12 | kcal/mol | N/A | Verevkin, 1998 | AC |
Reduced pressure boiling point
Tboil (K) | Pressure (atm) | Reference | Comment |
---|---|---|---|
421.2 | 0.0004 | Aldrich Chemical Company Inc., 1990 | BS |
Enthalpy of vaporization
ΔvapH (kcal/mol) | Temperature (K) | Method | Reference | Comment |
---|---|---|---|---|
21.5 ± 0.36 | 314. to 338. | GS | Verevkin, 1998 | AC |
Enthalpy of fusion
ΔfusH (kcal/mol) | Temperature (K) | Method | Reference | Comment |
---|---|---|---|---|
4.099 | 305.5 | DSC | Verevkin, 1998 | AC |

References

Perisanu, Banciu, et al., 1993
Perisanu, S.; Banciu, A.; Banciu, M.,
The standard enthalpies of formation of some dibenzocycloheptane ketones,
Thermochim. Acta, 1993, 228, 393-396. [all data]
Verevkin, 1998
Verevkin, S.P.,
Thermochemistry of aromatic ketones. Experimental enthalpies of formation and structural effects,
Thermochim. Acta, 1998, 310, 229-235. [all data]
Aldrich Chemical Company Inc., 1990
Aldrich Chemical Company Inc.,
Catalog Handbook of Fine Chemicals, Aldrich Chemical Company, Inc., Milwaukee WI, 1990, 1. [all data]