Cyclopentanone
- Formula: C5H8O
- Molecular weight: 84.1164
- IUPAC Standard InChIKey: BGTOWKSIORTVQH-UHFFFAOYSA-N
- CAS Registry Number: 120-92-3
- Chemical structure:

Gas phase thermochemistry data

Data compiled as indicated in comments:
ALS - Hussein Y. Afeefy, Joel F. Liebman, and Stephen E. Stein
GT - Glushko Thermocenter, Russian Academy of Sciences, Moscow
Quantity | Value | Units | Method | Reference | Comment |
---|---|---|---|---|---|
ΔfH°gas | -197.4 ± 1.3 | kJ/mol | Cm | Wiberg, Crocker, et al., 1991 | ALS |
ΔfH°gas | -194.8 ± 1.7 | kJ/mol | Ccb | Wolf, 1972 | ALS |
ΔfH°gas | -193.0 ± 1.8 | kJ/mol | Ccb | Sellers and Sunner, 1962 | Reanalyzed by Cox and Pilcher, 1970, Original value = -193.8 kJ/mol; ALS |
Constant pressure heat capacity of gas
Cp,gas (J/mol*K) | Temperature (K) | Reference | Comment |
---|---|---|---|
38.31 | 50. | Thermodynamics Research Center, 1997 | p=1 bar. Selected entropies and heat capacities agree within 2 J/mol*K with statistical values calculated by [ Shvaro O.V., 1987] except for S(1000 K) which value is about 6 J/mol*K lower than that of [ Thermodynamics Research Center, 1997]. Discrepancies with statistical calculation of [ Andreevskii D.N., 1976] amount to 4-12 J/mol*K for S(T) and 3-8 J/mol*K for Cp(T).; GT |
45.17 | 100. | ||
53.92 | 150. | ||
65.64 | 200. | ||
87.22 | 273.15 | ||
95.33 | 298.15 | ||
95.93 | 300. | ||
128.42 | 400. | ||
157.31 | 500. | ||
181.43 | 600. | ||
201.42 | 700. | ||
218.14 | 800. | ||
232.24 | 900. | ||
244.21 | 1000. | ||
254.41 | 1100. | ||
263.1 | 1200. | ||
270.6 | 1300. | ||
277.1 | 1400. | ||
282.6 | 1500. |
Constant pressure heat capacity of gas
Cp,gas (J/mol*K) | Temperature (K) | Reference | Comment |
---|---|---|---|
116.90 | 360. | Shvaro O.V., 1987 | GT |
121.16 | 375. | ||
128.03 | 400. | ||
133.86 | 420. | ||
139.31 | 440. | ||
144.04 | 460. | ||
149.22 | 480. |

Phase change data

Data compiled as indicated in comments:
BS - Robert L. Brown and Stephen E. Stein
TRC - Thermodynamics Research Center, NIST Boulder Laboratories, Chris Muzny director
AC - William E. Acree, Jr., James S. Chickos
ALS - Hussein Y. Afeefy, Joel F. Liebman, and Stephen E. Stein
Quantity | Value | Units | Method | Reference | Comment |
---|---|---|---|---|---|
Tboil | 403. ± 1. | K | AVG | N/A | Average of 13 values; Individual data points |
Quantity | Value | Units | Method | Reference | Comment |
Tfus | 221.7 | K | N/A | Wurflinger and Kreutzenbeck, 1978 | Uncertainty assigned by TRC = 0.3 K; TRC |
Tfus | 220.05 | K | N/A | Sellers and Sunner, 1962 | Uncertainty assigned by TRC = 0.5 K; TRC |
Tfus | 222.6 | K | N/A | Anonymous, 1954 | Uncertainty assigned by TRC = 0.6 K; TRC |
Tfus | 221.85 | K | N/A | Timmermans, 1952 | Uncertainty assigned by TRC = 0.4 K; TRC |
Tfus | 221.85 | K | N/A | Timmermans and Hennaut-Roland, 1937 | Uncertainty assigned by TRC = 0.5 K; TRC |
Quantity | Value | Units | Method | Reference | Comment |
Ttriple | 221.44 | K | N/A | Shvaro, 1987 | Uncertainty assigned by TRC = 0.02 K; TRC |
Quantity | Value | Units | Method | Reference | Comment |
Tc | 624.5 | K | N/A | Ambrose and Ghiassee, 1987 | Uncertainty assigned by TRC = 2. K; TRC |
Quantity | Value | Units | Method | Reference | Comment |
Pc | 46.00 | bar | N/A | Ambrose and Ghiassee, 1987 | Uncertainty assigned by TRC = 0.50 bar; TRC |
Quantity | Value | Units | Method | Reference | Comment |
ΔvapH° | 42.6 ± 0.4 | kJ/mol | AVG | N/A | Average of 6 values; Individual data points |
Enthalpy of vaporization
ΔvapH (kJ/mol) | Temperature (K) | Method | Reference | Comment |
---|---|---|---|---|
41.5 | 338. | EB | Teodorescu, Barhala, et al., 2006 | Based on data from 323. to 403. K.; AC |
40.6 | 332. | N/A | Ambrose and Ghiassee, 1987, 2 | Based on data from 317. to 427. K.; AC |
42.6 | 308. | A | Stephenson and Malanowski, 1987 | Based on data from 293. to 404. K.; AC |
39.6 | 353. | A,EB | Stephenson and Malanowski, 1987 | Based on data from 338. to 416. K. See also Meyer and Hotz, 1976.; AC |
36.35 | 403.7 | N/A | Majer and Svoboda, 1985 | |
43.6 | 286. | N/A | Benson and Kistiakowsky, 1942 | Based on data from 273. to 299. K.; AC |
Antoine Equation Parameters
log10(P) = A − (B / (T + C))
P = vapor pressure (bar)
T = temperature (K)
View plot Requires a JavaScript / HTML 5 canvas capable browser.
Temperature (K) | A | B | C | Reference | Comment |
---|---|---|---|---|---|
273.09 to 298.79 | 1.08305 | 376.418 | -168.499 | Benson and Kistiakowsky, 1942 | Coefficents calculated by NIST from author's data. |
Enthalpy of fusion
ΔfusH (kJ/mol) | Temperature (K) | Reference | Comment |
---|---|---|---|
11.4 | 221.2 | Gonthier-Vassal and Szwarc, 1998 | AC |

Reaction thermochemistry data

Data compiled as indicated in comments:
ALS - Hussein Y. Afeefy, Joel F. Liebman, and Stephen E. Stein
B - John E. Bartmess
Individual Reactions
By formula: C5H8O + H2 = C5H10O
Quantity | Value | Units | Method | Reference | Comment |
---|---|---|---|---|---|
ΔrH° | -60.25 ± 0.67 | kJ/mol | Cm | Wiberg, Crocker, et al., 1991 | liquid phase; ALS |
ΔrH° | -51.25 ± 0.63 | kJ/mol | Chyd | Conn, Kistiakowsky, et al., 1939 | gas phase; Reanalyzed by Cox and Pilcher, 1970, Original value = -52.3 ± 0.3 kJ/mol; At 355 K; ALS |
C5H7O- + =
By formula: C5H7O- + H+ = C5H8O
Quantity | Value | Units | Method | Reference | Comment |
---|---|---|---|---|---|
ΔrH° | 1540. ± 18. | kJ/mol | G+TS | Brickhouse and Squires, 1988 | gas phase; B |
Quantity | Value | Units | Method | Reference | Comment |
ΔrG° | 1507. ± 17. | kJ/mol | IMRB | Brickhouse and Squires, 1988 | gas phase; B |
By formula: C5H10O = C5H8O + H2
Quantity | Value | Units | Method | Reference | Comment |
---|---|---|---|---|---|
ΔrH° | 54.9 ± 4.7 | kJ/mol | Eqk | Fedoseenko, Yursha, et al., 1984 | gas phase; ALS |
ΔrH° | 51.30 | kJ/mol | Eqk | Cubberley and Mueller, 1946 | gas phase; ALS |
By formula: C6H10O + H2O = C5H8O + CH4O
Quantity | Value | Units | Method | Reference | Comment |
---|---|---|---|---|---|
ΔrH° | -21.22 ± 0.69 | kJ/mol | Cm | Hine and Arata, 1976 | liquid phase; Heat of hydrolysis; ALS |
By formula: H2O + C7H14O2 = C5H8O + 2CH4O
Quantity | Value | Units | Method | Reference | Comment |
---|---|---|---|---|---|
ΔrH° | 16. ± 2. | kJ/mol | Cm | Wiberg, Morgan, et al., 1994 | liquid phase; ALS |
By formula: C5H8O + 2CH4O = H2O + C7H14O2
Quantity | Value | Units | Method | Reference | Comment |
---|---|---|---|---|---|
ΔrH° | -44. ± 1. | kJ/mol | Cm | Wiberg, Morgan, et al., 1994 | gas phase; ALS |
By formula: C6H10O + C5H10O = C6H12O + C5H8O
Quantity | Value | Units | Method | Reference | Comment |
---|---|---|---|---|---|
ΔrH° | -11.6 ± 1.7 | kJ/mol | Eqk | Fedoseenko, Yursha, et al., 1984 | gas phase; ALS |

Condensed phase thermochemistry data

Data compiled by: Hussein Y. Afeefy, Joel F. Liebman, and Stephen E. Stein
Quantity | Value | Units | Method | Reference | Comment |
---|---|---|---|---|---|
ΔfH°liquid | -240.2 ± 1.3 | kJ/mol | Cm | Wiberg, Crocker, et al., 1991 | |
ΔfH°liquid | -237.4 ± 1.7 | kJ/mol | Ccb | Wolf, 1972 | |
ΔfH°liquid | -236.5 | kJ/mol | Ccb | Sellers and Sunner, 1962 | |
Quantity | Value | Units | Method | Reference | Comment |
ΔcH°liquid | -2873.5 ± 1.6 | kJ/mol | Ccb | Wolf, 1972 | Corresponding ΔfHºliquid = -237.35 kJ/mol (simple calculation by NIST; no Washburn corrections) |
ΔcH°liquid | -2874.0 ± 0.92 | kJ/mol | Ccb | Sellers and Sunner, 1962 | Corresponding ΔfHºliquid = -236.9 kJ/mol (simple calculation by NIST; no Washburn corrections) |
ΔcH°liquid | -2870. ± 0.8 | kJ/mol | Ccb | Skuratov, Kozina, et al., 1957 | At 20C; Corresponding ΔfHºliquid = -241. kJ/mol (simple calculation by NIST; no Washburn corrections) |

Gas phase ion energetics data

Data evaluated as indicated in comments:
HL - Edward P. Hunter and Sharon G. Lias
L - Sharon G. Lias
Data compiled as indicated in comments:
B - John E. Bartmess
MM - Michael M. Meot-Ner (Mautner)
LBLHLM - Sharon G. Lias, John E. Bartmess, Joel F. Liebman, John L. Holmes, Rhoda D. Levin, and W. Gary Mallard
LLK - Sharon G. Lias, Rhoda D. Levin, and Sherif A. Kafafi
RDSH - Henry M. Rosenstock, Keith Draxl, Bruce W. Steiner, and John T. Herron
Quantity | Value | Units | Method | Reference | Comment |
---|---|---|---|---|---|
IE (evaluated) | 9.26 ± 0.01 | eV | N/A | N/A | L |
Quantity | Value | Units | Method | Reference | Comment |
Proton affinity (review) | 823.7 | kJ/mol | N/A | Hunter and Lias, 1998 | HL |
Quantity | Value | Units | Method | Reference | Comment |
Gas basicity | 794.0 | kJ/mol | N/A | Hunter and Lias, 1998 | HL |
Electron affinity determinations
EA (eV) | Method | Reference | Comment |
---|---|---|---|
0.00169 | EFD | Desfrancois, Abdoul-Carime, et al., 1994 | EA: 1.7 meV. Dipole-bound state.; B |
Proton affinity at 298K
Proton affinity (kJ/mol) | Reference | Comment |
---|---|---|
828. ± 4. | Morlender-Vais and Holmes, 2001 | MM |
Ionization energy determinations
IE (eV) | Method | Reference | Comment |
---|---|---|---|
9.28 ± 0.01 | PE | Cocksey, Eland, et al., 1971 | LLK |
9.25 ± 0.02 | PE | Chadwick, Frost, et al., 1971 | LLK |
9.26 ± 0.01 | PI | Watanabe, Nakayama, et al., 1962 | RDSH |
9.42 ± 0.03 | PI | Vilesov, 1960 | RDSH |
9.3 | PE | Bieri, Asbrink, et al., 1982 | Vertical value; LBLHLM |
9.10 | PE | Kovac and Klasinc, 1978 | Vertical value; LLK |
9.28 | PE | Gerson, Worley, et al., 1978 | Vertical value; LLK |
9.28 | PE | Hentrich, Gunkel, et al., 1974 | Vertical value; LLK |
9.25 ± 0.02 | PE | Chadwick, Frost, et al., 1971, 2 | Vertical value; LLK |
De-protonation reactions
C5H7O- + =
By formula: C5H7O- + H+ = C5H8O
Quantity | Value | Units | Method | Reference | Comment |
---|---|---|---|---|---|
ΔrH° | 1540. ± 18. | kJ/mol | G+TS | Brickhouse and Squires, 1988 | gas phase; B |
Quantity | Value | Units | Method | Reference | Comment |
ΔrG° | 1507. ± 17. | kJ/mol | IMRB | Brickhouse and Squires, 1988 | gas phase; B |

Kovats' RI, non-polar column, isothermal

Column type | Active phase | Temperature (C) | I | Reference | Comment |
---|---|---|---|---|---|
Packed | C78, Branched paraffin | 130. | 741.1 | Dallos, Sisak, et al., 2000 | He; Column length: 3.3 m |
Packed | C78, Branched paraffin | 130. | 740.9 | Reddy, Dutoit, et al., 1992 | Chromosorb G HP; Column length: 3.3 m |
Packed | Apolane | 130. | 744. | Dutoit, 1991 | Column length: 3.7 m |
Packed | Apiezon L | 120. | 770. | Bogoslovsky, Anvaer, et al., 1978 | Celite 545 |
Packed | Apiezon L | 160. | 780. | Bogoslovsky, Anvaer, et al., 1978 | Celite 545 |
Packed | Apiezon L | 130. | 766. | Bogoslovsky, Anvaer, et al., 1978 | |
Capillary | Squalane | 60. | 734. | Ryba, 1976 | Column length: 50. m; Column diameter: 0.25 mm |
Packed | Apiezon L | 130. | 766. | Wehrli and Kováts, 1959 | Celite; Column length: 2.25 m |

Kovats' RI, non-polar column, temperature ramp

Column type | Active phase | I | Reference | Comment |
---|---|---|---|---|
Capillary | DB-1 | 752. | Takeoka, Perrino, et al., 1996 | 60. m/0.25 mm/0.25 μm, 30. C @ 4. min, 2. K/min; Tend: 220. C |
Capillary | DB-1 | 759. | Takeoka, Perrino, et al., 1996 | 60. m/0.25 mm/0.25 μm, 30. C @ 4. min, 2. K/min; Tend: 220. C |

Van Den Dool and Kratz RI, non-polar column, temperature ramp

Column type | Active phase | I | Reference | Comment |
---|---|---|---|---|
Capillary | DB-5 | 797. | Methven L., Tsoukka M., et al., 2007 | 60. m/0.32 mm/1. μm, 40. C @ 2. min, 4. K/min, 260. C @ 10. min |
Capillary | CP-Sil 8CB-MS | 795. | Hierro, de la Hoz, et al., 2004 | 60. m/0.25 mm/0.25 μm, 40. C @ 2. min, 4. K/min, 280. C @ 5. min |
Capillary | DB-1 | 749.6 | Sun and Stremple, 2003 | 30. m/0.25 mm/0.25 μm, He, 3. K/min; Tstart: 40. C; Tend: 325. C |
Capillary | DB-5 | 793.8 | Xu, van Stee, et al., 2003 | 30. m/0.25 mm/1. μm, He, 2.5 K/min; Tstart: 50. C; Tend: 200. C |
Capillary | SPB-1 | 766. | Larráyoz, Addis, et al., 2001 | 30. m/0.32 mm/4. μm, He, 45. C @ 13. min, 5. K/min, 240. C @ 5. min |

Van Den Dool and Kratz RI, non-polar column, custom temperature program

Column type | Active phase | I | Reference | Comment |
---|---|---|---|---|
Capillary | CP-Sil 8CB-MS | 798. | Elmore, Mottram, et al., 2000 | 60. m/0.25 mm/0.25 μm, He; Program: 0C(5min) => 40C/min => 40C (2min) => 4C/min => 280C |
Capillary | DB-5 | 808. | Parker, Hassell, et al., 2000 | 50. m/0.32 mm/0.5 μm, He; Program: oC(5min) => 60C/min => 60C (5min) => 4C/min => 250C |
Capillary | BPX-5 | 811. | Elmore, Mottram, et al., 1999 | 50. m/0.32 mm/0.5 μm, He; Program: 0C(5min) => 40C/min => 40C(2min) => 4C/min => 280C |

Van Den Dool and Kratz RI, polar column, temperature ramp

Column type | Active phase | I | Reference | Comment |
---|---|---|---|---|
Capillary | CP-Wax 52CB | 1176. | Alasalvar, Taylor, et al., 2005 | 60. m/0.25 mm/0.25 μm, 35. C @ 4. min, 3. K/min; Tend: 203. C |
Capillary | Supelcowax-10 | 1200. | Elmore, Nisyrios, et al., 2005 | 60. m/0.25 mm/0.25 μm, He, 40. C @ 2. min, 4. K/min; Tend: 280. C |
Capillary | DB-Wax | 1144. | Fröhlich, Duque, et al., 1989 | 30. m/0.25 mm/0.25 μm, He, 50. C @ 3. min, 4. K/min; Tend: 250. C |
Capillary | DB-Wax | 1150. | Fröhlich, Duque, et al., 1989 | 30. m/0.25 mm/0.25 μm, He, 50. C @ 3. min, 4. K/min; Tend: 250. C |
Capillary | CP-WAX 57CB | 1164. | Baltes and Mevissen, 1988 | He, 50. C @ 5. min, 2. K/min; Column length: 50. m; Column diameter: 0.24 mm; Tend: 210. C |
Capillary | PEG-20M | 1211.7 | Wang and Sun, 1985 | 2. K/min; Column length: 62. m; Column diameter: 0.27 mm; Tstart: 100. C |
Capillary | PEG-20M | 1200. | Wang and Sun, 1985 | 3. K/min; Column length: 62. m; Column diameter: 0.27 mm; Tstart: 70. C |
Capillary | PEG-20M | 1203.1 | Wang and Sun, 1985 | 4. K/min; Column length: 62. m; Column diameter: 0.27 mm; Tstart: 70. C |
Capillary | PEG-20M | 1200. | Wang and Sun, 1985 | 2. K/min; Column length: 62. m; Column diameter: 0.27 mm; Tstart: 80. C |
Capillary | PEG-20M | 1206.3 | Wang and Sun, 1985 | 2. K/min; Column length: 62. m; Column diameter: 0.27 mm; Tstart: 90. C |
Capillary | Carbowax 20M | 1166. | Chen, Kuo, et al., 1982 | He, 50. C @ 10. min, 1. K/min; Tend: 160. C |

Normal alkane RI, non-polar column, isothermal

Column type | Active phase | Temperature (C) | I | Reference | Comment |
---|---|---|---|---|---|
Capillary | Polydimethyl siloxane | 105. | 771. | Tello, Lebron-Aguilar, et al., 2009 | |
Capillary | Polydimethyl siloxane | 75. | 764. | Tello, Lebron-Aguilar, et al., 2009 | |
Capillary | Polydimethyl siloxane | 90. | 767. | Tello, Lebron-Aguilar, et al., 2009 | |
Capillary | Methyl Silicone | 100. | 769. | Lebrón-Aguilar, Quintanilla-López, et al., 2007 | |
Capillary | Methyl Silicone | 120. | 775. | Lebrón-Aguilar, Quintanilla-López, et al., 2007 | |
Capillary | Methyl Silicone | 140. | 780. | Lebrón-Aguilar, Quintanilla-López, et al., 2007 | |
Capillary | Methyl Silicone | 80. | 764. | Lebrón-Aguilar, Quintanilla-López, et al., 2007 |

Normal alkane RI, non-polar column, temperature ramp

Column type | Active phase | I | Reference | Comment |
---|---|---|---|---|
Capillary | VF-5 MS | 793. | Leffingwell and Alford, 2011 | 60. m/0.32 mm/0.25 μm, Helium, 2. K/min, 260. C @ 28. min; Tstart: 30. C |
Capillary | VF-5 MS | 794. | Leffingwell and Alford, 2011 | 60. m/0.32 mm/0.25 μm, Helium, 2. K/min, 260. C @ 28. min; Tstart: 30. C |
Capillary | SPB-5 | 791. | Vasta, Ratel, et al., 2007 | 60. m/0.32 mm/1. μm, 40. C @ 5. min, 3. K/min, 230. C @ 5. min |
Capillary | MDN-5 | 791. | van Loon, Linssen, et al., 2005 | 60. m/0.25 mm/0.25 μm, He, 40. C @ 4. min, 4. K/min, 270. C @ 5. min |
Capillary | SPB-5 | 789. | Poligné, Collignan, et al., 2001 | 60. m/0.32 mm/1. μm, He, 3. K/min; Tstart: 40. C; Tend: 200. C |
Capillary | DB-1 | 747. | Lu, Yu, et al., 1997 | 60. m/0.32 mm/1. μm, He, 40. C @ 2. min, 2. K/min, 280. C @ 40. min |
Capillary | DB-1 | 767. | Ciccioli, Cecinato, et al., 1992 | 60. m/0.32 mm/1.2 μm, He, 30. C @ 10. min, 3. K/min; Tend: 240. C |
Capillary | DB-1 | 761. | Habu, Flath, et al., 1985 | 3. K/min; Column length: 50. m; Column diameter: 0.32 mm; Tstart: 0. C; Tend: 250. C |

Normal alkane RI, non-polar column, custom temperature program

Column type | Active phase | I | Reference | Comment |
---|---|---|---|---|
Capillary | HP-5 | 796. | Thierry, Maillard, et al., 2005 | 60. m/0.32 mm/1. μm; Program: not specified |
Capillary | SE-30 | 802. | Vinogradov, 2004 | Program: not specified |
Capillary | SPB-5 | 788. | Begnaud, Pérès, et al., 2003 | 60. m/0.32 mm/1. μm; Program: not specified |
Capillary | DB-5MS | 767. | Fu, Yoon, et al., 2002 | Program: not specified |
Capillary | HP-5 | 766. | Jordán, Goodner, et al., 2002 | 30. m/0.25 mm/0.25 μm; Program: not specified |
Capillary | Methyl phenyl siloxane (not specified) | 789. | Poligne, Collignan, et al., 2002 | Program: not specified |
Capillary | DB-5 | 791. | Mateo and Zumalacárregui, 1996 | 50. m/0.32 mm/0.25 μm, He; Program: 40C (10min) => 3C/min => 95C => 10C/min => 270C (10min) |
Capillary | DB-5 | 794. | Mateo and Zumalacárregui, 1996 | 50. m/0.32 mm/0.25 μm, He; Program: 40C (10min) => 3C/min => 95C => 10C/min => 270C (10min) |
Capillary | DB-1 | 754. | Ciccioli, Cecinato, et al., 1994 | 60. m/0.32 mm/0.25 μm; Program: not specified |
Capillary | SPB-1 | 761.1 | Chang, Giang, et al., 1993 | 30. m/0.53 mm/1.5 μm; Program: 35C (6min) => 3C/min => 100C => 6C/min => 250C => 30C => 260C (2.5min) |
Capillary | DB-1 | 754. | Ciccioli, Brancaleoni, et al., 1993 | 60. m/0.32 mm/0.25 μm; Program: 3 min at 5 C; 5 - 50 C at 3 deg/min; 50 - 220 C at 5 deg/min |

Normal alkane RI, polar column, temperature ramp

Column type | Active phase | I | Reference | Comment |
---|---|---|---|---|
Capillary | HP-Innowax | 1170. | Puvipirom and Chaisei, 2012 | 15. m/0.32 mm/0.50 μm, Helium, 3. K/min; Tstart: 40. C; Tend: 250. C |
Capillary | HP-Innowax | 1192. | Soria, Sanz, et al., 2008 | 50. m/0.20 mm/0.20 μm, Helium, 45. C @ 2. min, 4. K/min, 190. C @ 50. min |
Capillary | PEG-20M | 1172. | Narain, Almeida, et al., 2004 | 50. m/0.20 mm/0.20 μm, 40. C @ 5. min, 3. K/min, 180. C @ 30. min |
Capillary | DB-Wax | 1154. | Fu, Yoon, et al., 2002 | 30. m/0.25 mm/0.25 μm, He, 40. C @ 5. min, 8. K/min, 250. C @ 5. min |
Capillary | DB-Wax | 1142. | Osorio, Duque, et al., 2002 | 30. m/0.25 mm/0.25 μm, He, 50. C @ 4. min, 4. K/min, 220. C @ 20. min |
Capillary | DB-Wax | 1144. | Osorio, Duque, et al., 2002 | 30. m/0.25 mm/0.25 μm, He, 50. C @ 4. min, 4. K/min, 220. C @ 20. min |
Capillary | HP-Wax | 1202. | Sanz, Maeztu, et al., 2002 | 60. m/0.25 mm/0.5 μm, He, 40. C @ 6. min, 3. K/min; Tend: 190. C |
Capillary | DB-Wax | 1170. | Wei, Mura, et al., 2001 | 60. m/0.25 mm/0.25 μm, He, 2. K/min; Tstart: 40. C; Tend: 200. C |
Capillary | DB-Wax | 1176. | Pollak and Berger, 1996 | 30. m/0.32 mm/0.5 μm, He, 40. C @ 1. min, 3. K/min, 210. C @ 25. min |

Normal alkane RI, polar column, custom temperature program

Column type | Active phase | I | Reference | Comment |
---|---|---|---|---|
Capillary | DB-Wax | 1154. | Welke, Manfroi, et al., 2012 | 30. m/0.25 mm/0.25 μm, Helium; Program: not specified |
Capillary | DB-Wax | 1186. | Welke, Manfroi, et al., 2012 | 30. m/0.25 mm/0.25 μm, Helium; Program: not specified |
Capillary | DB-Wax | 1187. | Peng, Yang, et al., 1991 | Program: not specified |
Capillary | Carbowax | 1167. | Baltes and Bochmann, 1987 | Program: not specified |
Capillary | Carbowax | 1167. | Baltes and Bochmann, 1987 | Program: not specified |
Capillary | Carbowax | 1168. | Baltes and Bochmann, 1987 | Program: not specified |
Capillary | Carbowax | 1168. | Baltes and Bochmann, 1987 | Program: not specified |
Capillary | Carbowax 400, Carbowax 20M, Carbowax 1540, Carbowax 4000, Superox 06, PEG 20M, etc. | 1185. | Waggott and Davies, 1984 | Hydrogen; Column length: 50. m; Column diameter: 0.32 mm; Program: not specified |

Lee's RI, non-polar column, temperature ramp

Column type | Active phase | I | Reference | Comment |
---|---|---|---|---|
Capillary | DB-5 | 116. | Williams and Horne, 1995 | He, 60. C @ 2. min, 5. K/min; Column length: 25. m; Column diameter: 0.3 mm; Tend: 270. C |

References

Wiberg, Crocker, et al., 1991
Wiberg, K.B.; Crocker, L.S.; Morgan, K.M.,
Thermochemical studies of carbonyl compounds. 5. Enthalpies of reduction of carbonyl groups,
J. Am. Chem. Soc., 1991, 113, 3447-3450. [all data]
Wolf, 1972
Wolf, G.,
Thermochemische Untersuchungen an cyclischen Ketonen,
Helv. Chim. Acta, 1972, 55, 1446-1459. [all data]
Sellers and Sunner, 1962
Sellers, P.; Sunner, S.,
Heats of combustion of cyclic ketones and alcohols,
Acta Chem. Scand., 1962, 16, 46-52. [all data]
Cox and Pilcher, 1970
Cox, J.D.; Pilcher, G.,
Thermochemistry of Organic and Organometallic Compounds, Academic Press, New York, 1970, 1-636. [all data]
Thermodynamics Research Center, 1997
Thermodynamics Research Center,
Selected Values of Properties of Chemical Compounds., Thermodynamics Research Center, Texas A&M University, College Station, Texas, 1997. [all data]
Shvaro O.V., 1987
Shvaro O.V.,
Thermodynamic properties of cyclopentanone and cyclohexanone,
Inzh.-Fiz. Zh., 1987, 52, 807-812. [all data]
Andreevskii D.N., 1976
Andreevskii D.N.,
Thermodynamic properties of C4-C6 cyclic ketones,
Zh. Prikl. Khim., 1976, 49, 1819-1823. [all data]
Wurflinger and Kreutzenbeck, 1978
Wurflinger, Alber (see wuerfl a); Kreutzenbeck, J.,
J. Phys. Chem. Solids, 1978, 39, 193. [all data]
Anonymous, 1954
Anonymous, R.,
, Am. Pet. Inst. Res. Proj. 45, Tech. Rep. 13, Ohio State Univ., 1954. [all data]
Timmermans, 1952
Timmermans, J.,
Freezing points of organic compounds. VVI New determinations.,
Bull. Soc. Chim. Belg., 1952, 61, 393. [all data]
Timmermans and Hennaut-Roland, 1937
Timmermans, J.; Hennaut-Roland, M.,
Works from International Bureau at Physical-Chemical Standards. VIII. Physical constants of 20 organic compounds,
J. Chim. Phys. Phys.-Chim. Biol., 1937, 34, 693. [all data]
Shvaro, 1987
Shvaro, O.V.,
Thermodynamics of some cyclic and acyclic ketones and alcohols C4-C7, Ph.D. Thesis, Byeloruss. State Univ., Minsk, 1987. [all data]
Ambrose and Ghiassee, 1987
Ambrose, D.; Ghiassee, N.B.,
Vapor Pressures and Critical Temperatures and Critical Pressures of C5 and C6 Cyclic Alcohols and Ketones,
J. Chem. Thermodyn., 1987, 19, 903. [all data]
Teodorescu, Barhala, et al., 2006
Teodorescu, Mariana; Barhala, Alexandru; Dragoescu, Dana,
Isothermal (vapour+liquid) equilibria for the binary (cyclopentanone or cyclohexanone with 1,1,2,2-tetrachloroethane) systems at temperatures of (343.15, 353.15, and 363.15)K,
The Journal of Chemical Thermodynamics, 2006, 38, 11, 1432-1437, https://doi.org/10.1016/j.jct.2006.01.010
. [all data]
Ambrose and Ghiassee, 1987, 2
Ambrose, D.; Ghiassee, N.B.,
Vapour pressures and critical temperatures and critical pressures of C5 and C6 cyclic alcohols and ketones,
The Journal of Chemical Thermodynamics, 1987, 19, 9, 903-909, https://doi.org/10.1016/0021-9614(87)90036-X
. [all data]
Stephenson and Malanowski, 1987
Stephenson, Richard M.; Malanowski, Stanislaw,
Handbook of the Thermodynamics of Organic Compounds, 1987, https://doi.org/10.1007/978-94-009-3173-2
. [all data]
Meyer and Hotz, 1976
Meyer, Edwin F.; Hotz, Carol A.,
Cohesive energies in polar organic liquids. 3. Cyclic ketones,
J. Chem. Eng. Data, 1976, 21, 3, 274-279, https://doi.org/10.1021/je60070a035
. [all data]
Majer and Svoboda, 1985
Majer, V.; Svoboda, V.,
Enthalpies of Vaporization of Organic Compounds: A Critical Review and Data Compilation, Blackwell Scientific Publications, Oxford, 1985, 300. [all data]
Benson and Kistiakowsky, 1942
Benson, S.W.; Kistiakowsky, G.B.,
The Photochemical Decomposition of Cyclic Ketones,
J. Am. Chem. Soc., 1942, 64, 1, 80-86, https://doi.org/10.1021/ja01253a021
. [all data]
Gonthier-Vassal and Szwarc, 1998
Gonthier-Vassal, Anne; Szwarc, Henri,
Thermodynamic properties of cycloketones: A DSC study,
Thermochimica Acta, 1998, 320, 1-2, 141-154, https://doi.org/10.1016/S0040-6031(98)00409-2
. [all data]
Conn, Kistiakowsky, et al., 1939
Conn, J.B.; Kistiakowsky, G.B.; Smith, E.A.,
Heats of organic reactions. VIII. Some further hydrogenations, including those of some acetylenes,
J. Am. Chem. Soc., 1939, 61, 1868-1876. [all data]
Brickhouse and Squires, 1988
Brickhouse, M.D.; Squires, R.R.,
Gas Phase Bronsted vs. Lewis Acid-Base Reactions of 6,6-Dimethylfulvene. A Sensitive Probe of the Electronic Structures of Organic Anions,
J. Am. Chem. Soc., 1988, 110, 9, 2706, https://doi.org/10.1021/ja00217a002
. [all data]
Fedoseenko, Yursha, et al., 1984
Fedoseenko, V.I.; Yursha, I.A.; Kabo, G.Ya.,
Equilibrium of cyclopentanol dehydrogenation and hydrogen disproportionation in the cyclopentanol-cyclohexanone system,
Dokl. Akad. Nauk BSSR, 1984, 28, 1109-1112. [all data]
Cubberley and Mueller, 1946
Cubberley, A.H.; Mueller, M.B.,
Equilibrium studies on the dehydrogenation of primary and secondary alcohols. I. 2-Butanol, 2-octanol, cyclopentanol and benzyl alcohol,
J. Am. Chem. Soc., 1946, 68, 1149-1151. [all data]
Hine and Arata, 1976
Hine, J.; Arata, K.,
Keto-Enol tautomerism. I. The calorimetrical determination of the equilibrium constant for keto-enol tautomerism for cyclopentanone and acetone,
Bull. Chem. Soc. Jpn., 1976, 49, 3085-3088. [all data]
Wiberg, Morgan, et al., 1994
Wiberg, K.B.; Morgan, K.M.; Maltz, H.,
Thermochemistry of carbonyl reactions. 6. A study of hydration equilibria,
J. Am. Chem. Soc., 1994, 116, 11067-11077. [all data]