(Cyclocta-1,5-diene)platinum(II)chloride
- Formula: C8H12Cl2Pt
- Molecular weight: 374.171
- IUPAC Standard InChIKey: BJGDNWIRCMJDDF-PHFPKPIQSA-L
- CAS Registry Number: 12080-32-9
- Chemical structure:

Condensed phase thermochemistry data

Data compiled by: José A. Martinho Simões
Quantity | Value | Units | Method | Reference | Comment |
---|---|---|---|---|---|
ΔfH°solid | -208. ± 11. | kJ/mol | Review | Martinho Simões |

Phase change data

Data compiled by: José A. Martinho Simões
Quantity | Value | Units | Method | Reference | Comment |
---|---|---|---|---|---|
ΔsubH° | 130. ± 20. | kJ/mol | TD-HFC | Al Takhin, Skinner, et al., 1984 |

Gas phase thermochemistry data

Data compiled by: José A. Martinho Simões
Quantity | Value | Units | Method | Reference | Comment |
---|---|---|---|---|---|
ΔfH°gas | -18.5 ± 5.4 | kcal/mol | Review | Martinho Simões |

References

Martinho Simões
Martinho Simões, J.A.,
Private communication (see http://webbook.nist.gov/chemistry/om/). [all data]
Al Takhin, Skinner, et al., 1984
Al Takhin, G.; Skinner, H.A.; Zaki, A.A.,
J. Chem. Soc., Dalton Trans., 1984, 371.. [all data]