Cyclopentadienylmolybdenumtricarbonyl bromide
- Formula: C8H5BrMoO3
- Molecular weight: 324.99
- IUPAC Standard InChIKey: TZKHSYVISKXYTG-UHFFFAOYSA-M
- CAS Registry Number: 12079-79-7
- Chemical structure:
View 3d structure (requires JavaScript / HTML 5) - Other names: Molybdenum, bromotricarbonyl(η5-2,4-cyclopentadien-1-yl)-; Molybdenum, bromotricarbonylcyclopentadienyl-; Bromotricarbonyl(η-cyclopentadienyl)molybdenum

Reaction thermochemistry data

Data compiled by: José A. Martinho Simões
Individual Reactions
C8H6MoO3 (cr) + (solution) =
(solution) +
(cr)
By formula: C8H6MoO3 (cr) + Br2 (solution) = HBr (solution) + C8H5BrMoO3 (cr)
Quantity | Value | Units | Method | Reference | Comment |
---|---|---|---|---|---|
ΔrH° | -150. ± 12. | kJ/mol | N/A | Nolan, López de la Vega, et al., 1986 | solvent: Carbon tetrachloride; The reaction enthalpy was calculated Nolan, López de la Vega, et al., 1986 from the experimental values for the enthalpies of the following reactions: Mo(Cp)(CO)3(H)(cr) + 2Br2(solution) = Mo(Cp)(CO)2(Br)3(solution) + HBr(solution) + CO(solution), -254.0 ± 8.4 kJ/mol, and Mo(Cp)(CO)3(Br)(cr) + Br2(solution) = Mo(Cp)(CO)2(Br)3(solution) + CO(solution), -104.2 ± 8.4 kJ/mol |
C16H10Mo2O6 (cr) + (solution) = 2
(cr)
By formula: C16H10Mo2O6 (cr) + Br2 (solution) = 2C8H5BrMoO3 (cr)
Quantity | Value | Units | Method | Reference | Comment |
---|---|---|---|---|---|
ΔrH° | -177. ± 17. | kJ/mol | N/A | Nolan, López de la Vega, et al., 1986 | solvent: Carbon tetrachloride; The reaction enthalpy was calculated Nolan, López de la Vega, et al., 1986 from the experimental values for the enthalpies of the following reactions: [Mo(Cp)(CO)3]2(cr) + 3Br2(solution) = 2Mo(Cp)(CO)2(Br)3(solution) + 2CO(solution), -384.9 ± 4.2 kJ/mol, and Mo(Cp)(CO)3(Br)(cr) + Br2(solution) = Mo(Cp)(CO)2(Br)3(solution) + CO(solution), -104.2 ± 8.4 kJ/mol |
C8H6MoO3 (solution) + (solution) =
(solution) +
(solution)
By formula: C8H6MoO3 (solution) + CBr4 (solution) = C8H5BrMoO3 (solution) + CHBr3 (solution)
Quantity | Value | Units | Method | Reference | Comment |
---|---|---|---|---|---|
ΔrH° | -143.9 ± 8.4 | kJ/mol | RSC | Nolan, López de la Vega, et al., 1986 | solvent: Tetrahydrofuran; The enthalpy of solution of Mo(Cp)(CO)3(H)(cr) was measured as 8.8 ± 0.4 kJ/mol Nolan, López de la Vega, et al., 1986, 2. Reaction temperature: 323 K |
(cr) +
(solution) = C7H5Br3MoO2 (solution) +
(solution)
By formula: C8H5BrMoO3 (cr) + Br2 (solution) = C7H5Br3MoO2 (solution) + CO (solution)
Quantity | Value | Units | Method | Reference | Comment |
---|---|---|---|---|---|
ΔrH° | -104.2 ± 8.4 | kJ/mol | RSC | Nolan, López de la Vega, et al., 1986 | solvent: Carbon tetrachloride |

References

Nolan, López de la Vega, et al., 1986
Nolan, S.P.; López de la Vega, R.; Hoff, C.D.,
J. Organometal. Chem., 1986, 315, 187. [all data]
Nolan, López de la Vega, et al., 1986, 2
Nolan, S.P.; López de la Vega, R.; Hoff, C.D.,
Organometallics, 1986, 5, 2529. [all data]