Manganese, tricarbonyl(η5-2,4-cyclopentadien-1-yl)-
- Formula: C8H5MnO3
- Molecular weight: 204.0615
- IUPAC Standard InChIKey: CZPHEHHRMHXAIK-UHFFFAOYSA-N
- CAS Registry Number: 12079-65-1
- Chemical structure:
View 3d structure (requires JavaScript / HTML 5) - Other names: Manganese, tricarbonyl-π-cyclopentadienyl-; π-Cyclopentadienylmanganese tricarbonyl; Cyclopentadienylmanganese tricarbonyl; Cyclopentadienyltricarbonylmanganese; Cymantrene; Manganese, cyclopentadienyltricarbonyl-; Tricarbonyl-π-cyclopentadienylmanganese; Tricarbonylcyclopentadienylmanganese; (η5-Cyclopentadienyl) manganese tricarbonyl; Cyklopentadientrikarbonylmanganium; MCT; Tricarbonyl(η5-cyclopentadienyl)manganese; tricarbonyl(η-cyclopentadienyl)manganese

Gas phase thermochemistry data

Data compiled by: José A. Martinho Simões
Quantity | Value | Units | Method | Reference | Comment |
---|---|---|---|---|---|
ΔfH°gas | -473.5 ± 5.4 | kJ/mol | Review | Martinho Simões | |
ΔfH°gas | -490.3 ± 9.0 | kJ/mol | Review | Martinho Simões | |
ΔfH°gas | -426. ± 3. | kJ/mol | Review | Martinho Simões | |
ΔfH°gas | -481.9 ± 9.0 | kJ/mol | Review | Martinho Simões | Selected data. Average of the values from Evstigneeva and Shmyreva, 1965 and Lautsch, Erzberger, et al., 1958 |

Condensed phase thermochemistry data

Data compiled as indicated in comments:
MS - José A. Martinho Simões
DH - Eugene S. Domalski and Elizabeth D. Hearing
Quantity | Value | Units | Method | Reference | Comment |
---|---|---|---|---|---|
ΔfH°solid | -525.9 ± 4.4 | kJ/mol | Review | Martinho Simões | MS |
ΔfH°solid | -542.7 ± 8.5 | kJ/mol | Review | Martinho Simões | MS |
ΔfH°solid | -534.3 ± 8.4 | kJ/mol | Review | Martinho Simões | Selected data. Average of the values from Evstigneeva and Shmyreva, 1965 and Lautsch, Erzberger, et al., 1958; MS |
ΔfH°solid | -478. ± 1. | kJ/mol | CC-SB | Chipperfield, Sneyd, et al., 1979 | Value corrected based on a set of ancillary data by J.A. Martinho Simões; The value for the enthalpy of combustion is not reported in Chipperfield, Sneyd, et al., 1979; MS |
Quantity | Value | Units | Method | Reference | Comment |
ΔcH°solid | -3858.1 ± 4.2 | kJ/mol | CC-SB | Evstigneeva and Shmyreva, 1965 | Please also see Pedley and Rylance, 1977 and Cox and Pilcher, 1970.; MS |
ΔcH°solid | -3841.3 ± 8.4 | kJ/mol | CC-SB | Lautsch, Tröber, et al., 1963 | Please also see Lautsch, Erzberger, et al., 1958, Pedley and Rylance, 1977, and Cox and Pilcher, 1970.; MS |
Quantity | Value | Units | Method | Reference | Comment |
S°solid,1 bar | 259.35 | J/mol*K | N/A | Chhor, Pommier, et al., 1983 | DH |
Constant pressure heat capacity of solid
Cp,solid (J/mol*K) | Temperature (K) | Reference | Comment |
---|---|---|---|
214.79 | 298.15 | Chhor, Pommier, et al., 1983 | T = 10 to 300 K.; DH |

Phase change data

Data compiled as indicated in comments:
TRC - Thermodynamics Research Center, NIST Boulder Laboratories, Chris Muzny director
AC - William E. Acree, Jr., James S. Chickos
MS - José A. Martinho Simões
DH - Eugene S. Domalski and Elizabeth D. Hearing
Quantity | Value | Units | Method | Reference | Comment |
---|---|---|---|---|---|
Ttriple | 350. | K | N/A | Chhor, Pommier, et al., 1983, 2 | Crystal phase 1 phase; Uncertainty assigned by TRC = 2. K; TRC |
Quantity | Value | Units | Method | Reference | Comment |
ΔsubH° | 72.0 ± 3.9 | kJ/mol | ME | Picciochi, Canongia Lopes, et al., 2008 | AC |
ΔsubH° | 76.0 ± 0.4 | kJ/mol | C | Picciochi, Canongia Lopes, et al., 2008 | AC |
ΔsubH° | 52.4 ± 3.1 | kJ/mol | CC-SB | Baev and Demyanchuck, 1970 | MS |
Enthalpy of vaporization
ΔvapH (kJ/mol) | Temperature (K) | Reference | Comment |
---|---|---|---|
50.8 | 421. | Baev and Demyanchuck, 1970 | Based on data from 353. to 489. K.; AC |
Enthalpy of sublimation
ΔsubH (kJ/mol) | Temperature (K) | Method | Reference | Comment |
---|---|---|---|---|
72.2 ± 3.9 | 294. | ME | Picciochi, Canongia Lopes, et al., 2008 | AC |
75.8 ± 0.4 | 305. | C | Picciochi, Canongia Lopes, et al., 2008 | AC |
52.7 ± 3.1 | 338. | N/A | Pilcher and Skinner, 1983 | Based on data from 323. to 353. K. See also Evstigneeva and Shmyreva, 1965 and Baev and Demyanchuck, 1970.; AC |
64. ± 12. | 339. | ME | Cordes and Schreiner, 1959 | Based on data from 335. to 343. K. See also Picciochi, Canongia Lopes, et al., 2008.; AC |
Enthalpy of fusion
ΔfusH (kJ/mol) | Temperature (K) | Method | Reference | Comment |
---|---|---|---|---|
19.300 | 350. | N/A | Chhor, Pommier, et al., 1983 | DH |
18.9 | 350.1 | DSC | Picciochi, Canongia Lopes, et al., 2008 | AC |
Entropy of fusion
ΔfusS (J/mol*K) | Temperature (K) | Reference | Comment |
---|---|---|---|
55. | 350. | Chhor, Pommier, et al., 1983 | DH |
Temperature of phase transition
Ttrs (K) | Initial Phase | Final Phase | Reference | Comment |
---|---|---|---|---|
75. to 135. | crystaline, II | crystaline, I | Chhor, Pommier, et al., 1983 | S = <1 J/mol*K "Abnormally" high heat capacity.; DH |

Reaction thermochemistry data

Data compiled by: José A. Martinho Simões
Individual Reactions
(solution) +
(solution) = C14H21MnO2 (solution) +
(solution)
By formula: C8H5MnO3 (solution) + C7H16 (solution) = C14H21MnO2 (solution) + CO (solution)
Quantity | Value | Units | Method | Reference | Comment |
---|---|---|---|---|---|
ΔrH° | 196. ± 7. | kJ/mol | AVG | N/A | Average of 18 values; Individual data points |

Gas phase ion energetics data

Data compiled as indicated in comments:
LLK - Sharon G. Lias, Rhoda D. Levin, and Sherif A. Kafafi
RDSH - Henry M. Rosenstock, Keith Draxl, Bruce W. Steiner, and John T. Herron
Ionization energy determinations
IE (eV) | Method | Reference | Comment |
---|---|---|---|
7.6 | PE | Calabro, Hubbard, et al., 1981 | LLK |
8.06 ± 0.01 | EI | Efraty, Huang, et al., 1975 | LLK |
8.12 | EI | Muller, Fenderl, et al., 1971 | LLK |
8.1 ± 0.1 | EI | Muller and Fenderl, 1971 | LLK |
8.1 ± 0.1 | EI | Muller and Herberhold, 1968 | RDSH |
8.3 ± 0.4 | EI | Winters and Kiser, 1965 | RDSH |
8.05 | PE | Calabro, Hubbard, et al., 1981 | Vertical value; LLK |
8.05 | PE | Lichtenberger and Fenske, 1976 | Vertical value; LLK |
Appearance energy determinations
Ion | AE (eV) | Other Products | Method | Reference | Comment |
---|---|---|---|---|---|
C3H3+ | 20.3 ± 0.4 | ? | EI | Winters and Kiser, 1965 | RDSH |
C5H5Mn+ | 11.67 ± 0.04 | 3CO | EI | Efraty, Huang, et al., 1975 | LLK |
C5H5Mn+ | 11.0 ± 0.3 | 3CO | EI | Muller and Herberhold, 1968 | RDSH |
C6H5OMn+ | 9.28 ± 0.01 | 2CO | EI | Efraty, Huang, et al., 1975 | LLK |
C6H5OMn+ | 9.5 ± 0.2 | 2CO | EI | Muller and Herberhold, 1968 | RDSH |
C7H5O2Mn+ | 8.37 ± 0.01 | CO | EI | Efraty, Huang, et al., 1975 | LLK |
C7H5O2Mn+ | 8.8 ± 0.1 | CO | EI | Muller and Herberhold, 1968 | RDSH |
Mn+ | 15.32 ± 0.02 | 3CO+C5H5 | EI | Efraty, Huang, et al., 1975 | LLK |
Mn+ | 14.4 ± 0.5 | ? | EI | Muller and Herberhold, 1968 | RDSH |

References

Martinho Simões
Martinho Simões, J.A.,
Private communication (see http://webbook.nist.gov/chemistry/om/). [all data]
Evstigneeva and Shmyreva, 1965
Evstigneeva, E.V.; Shmyreva, G.O.,
Russ. J. Phys. Chem., 1965, 39, 529. [all data]
Lautsch, Erzberger, et al., 1958
Lautsch, W.F.; Erzberger, P.; Tröber, A.,
Wiss. Z. Tech. Hochsch. Chem. Leuna-Merseburg, 1958, 1, 31. [all data]
Chipperfield, Sneyd, et al., 1979
Chipperfield, J.R.; Sneyd, J.C.R.; Webster, D.E.,
J. Organometal. Chem., 1979, 178, 177. [all data]
Pedley and Rylance, 1977
Pedley, J.B.; Rylance, J.,
Computer Analysed Thermochemical Data: Organic and Organometallic Compounds, University of Sussex, Brigton, 1977. [all data]
Cox and Pilcher, 1970
Cox, J.D.; Pilcher, G.,
Thermochemistry of Organic and Organometallic Compounds
in Academic Press, New York, 1970. [all data]
Lautsch, Tröber, et al., 1963
Lautsch, W.F.; Tröber, A.; Zimmer, W.; Mehner, L.; Linck, W.; Lehmann, H.M.; Brandenberger, H.; Korner, H.; Metschker, H.-J.; Wagner, K.; Kaden, R.,
Z. Chem., 1963, 3, 415. [all data]
Chhor, Pommier, et al., 1983
Chhor, K.; Pommier, C.; Diot, M.,
Low-temperature thermodynamic study of cymantrene (C5H5Mn(CO)3) and azacymantrene (C4H4NMn(CO)3),
Mol. Cryst. Liq. Cryst., 1983, 100, 193-209. [all data]
Chhor, Pommier, et al., 1983, 2
Chhor, K.; Pommier, C.; Diot, M.,
Low-temp. thermodynamic study of cymantrene (C5H5Mn(CO)3) and azacymantrene (C4H4NMn(CO)3),
Mol. Cryst. Liq. Cryst., 1983, 100, 193. [all data]
Picciochi, Canongia Lopes, et al., 2008
Picciochi, Ricardo; Canongia Lopes, Jose N.; Diogo, Herminio P.; Minas da Piedade, Manuel E.,
Experimental and Molecular Dynamics Simulation Study of the Sublimation Energetics of Cyclopentadienyltricarbonylmanganese (Cymantrene),
J. Phys. Chem. A, 2008, 112, 41, 10429-10434, https://doi.org/10.1021/jp805607d
. [all data]
Baev and Demyanchuck, 1970
Baev, A.K.; Demyanchuck, V.V.,
Obshch. Prikl. Khim., 1970, 3, 65. [all data]
Pilcher and Skinner, 1983
Pilcher, G.; Skinner, H.A.,
Thermochemistry of organometallic compounds, 1983, 43-90, https://doi.org/10.1002/9780470771686.ch2
. [all data]
Cordes and Schreiner, 1959
Cordes, J.F.; Schreiner, S.,
Dampfdruckmessungen bei einigen Aromatenkomplexen,
Z. Anorg. Allg. Chem., 1959, 299, 1-2, 87-91, https://doi.org/10.1002/zaac.19592990111
. [all data]