Dicarbon
- Formula: C2
- Molecular weight: 24.0214
- IUPAC Standard InChIKey: LBVWYGNGGJURHQ-UHFFFAOYSA-N
- CAS Registry Number: 12070-15-4
- Chemical structure:
View 3d structure (requires JavaScript / HTML 5) - Permanent link for this species. Use this link for bookmarking this species for future reference.

Gas phase thermochemistry data

Quantity | Value | Units | Method | Reference | Comment |
---|---|---|---|---|---|
ΔfH°gas | 837.74 | kJ/mol | Review | Chase, 1998 | Data last reviewed in December, 1969 |
Quantity | Value | Units | Method | Reference | Comment |
S°gas,1 bar | 199.39 | J/mol*K | Review | Chase, 1998 | Data last reviewed in December, 1969 |
Gas Phase Heat Capacity (Shomate Equation)
Cp° = A + B*t + C*t2 + D*t3 +
E/t2
H° − H°298.15= A*t + B*t2/2 +
C*t3/3 + D*t4/4 − E/t + F − H
S° = A*ln(t) + B*t + C*t2/2 + D*t3/3 −
E/(2*t2) + G
Cp = heat capacity (J/mol*K)
H° = standard enthalpy (kJ/mol)
S° = standard entropy (J/mol*K)
t = temperature (K) / 1000.
View plot Requires a JavaScript / HTML 5 canvas capable browser.
Temperature (K) | 298. to 700. | 700. to 6000. |
---|---|---|
A | 123.9092 | 30.50408 |
B | -348.0067 | 5.445811 |
C | 485.0971 | -0.853373 |
D | -232.7994 | 0.065641 |
E | -1.240298 | 0.814750 |
F | 808.2777 | 831.5784 |
G | 426.6132 | 240.4039 |
H | 837.7372 | 837.7372 |
Reference | Chase, 1998 | Chase, 1998 |
Comment | Data last reviewed in December, 1969 | Data last reviewed in December, 1969 |

Reaction thermochemistry data

Data compiled as indicated in comments:
B - John E. Bartmess
M - Michael M. Meot-Ner (Mautner) and Sharon G. Lias
Individual Reactions
By formula: (C2H- • 4294967295C2) + C2 = C2H-
Quantity | Value | Units | Method | Reference | Comment |
---|---|---|---|---|---|
ΔrH° | 678. ± 16. | kJ/mol | N/A | Zhou, Garand, et al., 2007 | gas phase; B |
ΔrH° | 535. ± 16. | kJ/mol | Ther | Ruscic and Berkowitz, 1990 | gas phase; 376.7 0K; corrected with data from Gurvich, Veyts, et al.; B |
ΔrH° | 703. ± 11. | kJ/mol | Ther | Bartmess, Scott, et al., 1979 | gas phase; value altered from reference due to change in acidity scale; B |
By formula: (C+ • 2C) + C2 = (C+ • C2 • 2C)
Quantity | Value | Units | Method | Reference | Comment |
---|---|---|---|---|---|
ΔrH° | 745. | kJ/mol | MIKES | Radi, Rincon, et al., 1989 | gas phase; M |
By formula: C62+ + C2 = (C62+ • C2)
Quantity | Value | Units | Method | Reference | Comment |
---|---|---|---|---|---|
ΔrH° | 290. ± 50. | kJ/mol | MIKES | Radi, Hsu, et al., 1990 | gas phase; M |
By formula: C58+ + C2 = (C58+ • C2)
Quantity | Value | Units | Method | Reference | Comment |
---|---|---|---|---|---|
ΔrH° | 435. ± 50. | kJ/mol | MIKES | Radi, Hsu, et al., 1990 | gas phase; M |
By formula: C60+ + C2 = (C60+ • C2)
Quantity | Value | Units | Method | Reference | Comment |
---|---|---|---|---|---|
ΔrH° | 444. ± 50. | kJ/mol | MIKES | Radi, Hsu, et al., 1990 | gas phase; M |

Gas phase ion energetics data

Data evaluated as indicated in comments:
L - Sharon G. Lias
Data compiled as indicated in comments:
LL - Sharon G. Lias and Joel F. Liebman
LBLHLM - Sharon G. Lias, John E. Bartmess, Joel F. Liebman, John L. Holmes, Rhoda D. Levin, and W. Gary Mallard
LLK - Sharon G. Lias, Rhoda D. Levin, and Sherif A. Kafafi
RDSH - Henry M. Rosenstock, Keith Draxl, Bruce W. Steiner, and John T. Herron
B - John E. Bartmess
Quantity | Value | Units | Method | Reference | Comment |
---|---|---|---|---|---|
IE (evaluated) | 11.4 ± 0.3 | eV | N/A | N/A | L |
Electron affinity determinations
EA (eV) | Method | Reference | Comment |
---|---|---|---|
3.2730 ± 0.0080 | LPES | Arnold, Bradforth, et al., 1991 | B |
3.265 ± 0.022 | LPES | Ervin, Gronert, et al., 1990 | B |
3.391 ± 0.017 | LPD | Jones, Mead, et al., 1980 | B |
3.30 ± 0.10 | LPES | Yang, Taylor, et al., 1989 | EA given is Vertical Detachment Energy. probably linear structure.; B |
3.540 ± 0.050 | PD | Feldman, 1970 | B |
3.30 ± 0.20 | EIAE | Locht and Momigny, 1970 | From C2H2, C2H4; B |
>2.89998 | EIAE | Trepka and Neuert, 1963 | From C2H4; B |
>2.90 ± 0.50 | EIAE | Thynne and MacNiel, 1971 | From C2H4; B |
4.0 ± 1.0 | EIAE | Honig, 1954 | From graphite; B |
Ionization energy determinations
IE (eV) | Method | Reference | Comment |
---|---|---|---|
11.41 ± 0.30 | CIEL | Reid, Ballantine, et al., 1995 | LL |
11.92 ± 0.09 | DER | Plessis and Marmet, 1986 | LBLHLM |
12.15 | DER | Huber and Herzberg, 1979 | LLK |
11.1 ± 0.5 | EI | Gupta and Gingerich, 1979 | LLK |
10.9 ± 0.4 | EI | Cocke and Gingerich, 1974 | LLK |
11.1 ± 1.0 | EI | Cocke and Gingerich, 1972 | LLK |
12.0 ± 0.6 | EI | Drowart, Burns, et al., 1959 | RDSH |
13. | EI | Field, Franklin, et al., 1957 | RDSH |

Ion clustering data

Data compiled as indicated in comments:
M - Michael M. Meot-Ner (Mautner) and Sharon G. Lias
B - John E. Bartmess
Clustering reactions
By formula: (C+ • 2C) + C2 = (C+ • C2 • 2C)
Quantity | Value | Units | Method | Reference | Comment |
---|---|---|---|---|---|
ΔrH° | 178. | kcal/mol | MIKES | Radi, Rincon, et al., 1989 | gas phase; M |
By formula: (C2H- • 4294967295C2) + C2 = C2H-
Quantity | Value | Units | Method | Reference | Comment |
---|---|---|---|---|---|
ΔrH° | 162.0 ± 3.8 | kcal/mol | N/A | Zhou, Garand, et al., 2007 | gas phase; B |
ΔrH° | 127.8 ± 3.9 | kcal/mol | Ther | Ruscic and Berkowitz, 1990 | gas phase; 376.7 0K; corrected with data from Gurvich, Veyts, et al.; B |
ΔrH° | 168.0 ± 2.7 | kcal/mol | Ther | Bartmess, Scott, et al., 1979 | gas phase; value altered from reference due to change in acidity scale; B |
By formula: C58+ + C2 = (C58+ • C2)
Quantity | Value | Units | Method | Reference | Comment |
---|---|---|---|---|---|
ΔrH° | 104. ± 12. | kcal/mol | MIKES | Radi, Hsu, et al., 1990 | gas phase; M |
By formula: C60+ + C2 = (C60+ • C2)
Quantity | Value | Units | Method | Reference | Comment |
---|---|---|---|---|---|
ΔrH° | 106. ± 12. | kcal/mol | MIKES | Radi, Hsu, et al., 1990 | gas phase; M |
By formula: C62+ + C2 = (C62+ • C2)
Quantity | Value | Units | Method | Reference | Comment |
---|---|---|---|---|---|
ΔrH° | 69. ± 12. | kcal/mol | MIKES | Radi, Hsu, et al., 1990 | gas phase; M |

Constants of diatomic molecules

Data compiled by: Klaus P. Huber and Gerhard H. Herzberg
Data collected through JULY, 1976
Symbol | Meaning |
---|---|
State | electronic state and / or symmetry symbol |
Te | minimum electronic energy (cm-1) |
ωe | vibrational constant – first term (cm-1) |
ωexe | vibrational constant – second term (cm-1) |
ωeye | vibrational constant – third term (cm-1) |
Be | rotational constant in equilibrium position (cm-1) |
αe | rotational constant – first term (cm-1) |
γe | rotation-vibration interaction constant (cm-1) |
De | centrifugal distortion constant (cm-1) |
βe | rotational constant – first term, centrifugal force (cm-1) |
re | internuclear distance (Å) |
Trans. | observed transition(s) corresponding to electronic state |
ν00 | position of 0-0 band (units noted in table) |
State | Te | ωe | ωexe | ωeye | Be | αe | γe | De | βe | re | Trans. | ν00 |
---|---|---|---|---|---|---|---|---|---|---|---|---|
Theoretical work and potential functions Read and Vanerslice, 1962 Fougere and Nesbet, 1966 Verhaegen, Richards, et al., 1967 Verhaegen, 1968. | ||||||||||||
F 1Πu | [75456.9] | [1557.5] Z | 1.645 | 0.019 | 0.000006 | 1.307 | F ← X R | 74532.9 Z | ||||
↳missing citation | ||||||||||||
g 3Δg | [73183.6] 1 | [1458.06] Z | 1.5238 | 0.170 | 0.0000066 | 1.3579 | g ← a R | 71649.6 Z | ||||
↳missing citation | ||||||||||||
f 3Σg- | 71045.8 | 1360.5 Z | 14.8 | 1.448 2 | 0.04 3 | 0.006 | 0.000010 | 1.393 | f ← a R | 70188.4 Z | ||
↳missing citation | ||||||||||||
State | Te | ωe | ωexe | ωeye | Be | αe | γe | De | βe | re | Trans. | ν00 |
E 1Σg+ | 55034.7 | 1671.50 Z | 40.02 | 0.248 | 1.7897 | 0.0387 4 | -0.00055 | 0.0000083 | 0.0000006 | 1.2529 | E → A 5 V | 46668.3 Z |
↳missing citation | ||||||||||||
d 1Σu+ | 43239.44 | 1829.57 Z | 13.94 | 1.8332 6 | 0.0196 | 0.00000732 6 | 1.238 | D ↔ X 7 | 43226.74 6 Z | |||
↳missing citation; Norrish, Porter, et al., 1952; Messerle, 1968 | ||||||||||||
e 3Πg | 40796.65 8 | 1106.56 Z | 39.26 | 2.805 9 | 1.1922 | 0.0242 | 0.0000063 | 0.00000029 | 1.5351 | e → a 10 R | 39806.46 Z | |
↳missing citation | ||||||||||||
C' 1Πg | Preliminary constants from perturbations in C 1Πg; see Messerle and Krauss, 1967. | |||||||||||
State | Te | ωe | ωexe | ωeye | Be | αe | γe | De | βe | re | Trans. | ν00 |
C 1Πg | 34261.3 | 1809.1 Z | 15.81 11 | 1.7834 | 0.018 11 | 0.0000068 | 1.2552 | C → A 12 VR | 25969.19 Z | |||
↳Dieke and Lochte-Holtgreven, 1930; Herzberg and Sutton, 1940; Herzberg, 1945; Cisak, Dabrowska, et al., 1969 | ||||||||||||
d 3Πg | 20022.50 13 | 1788.22 Z | 16.440 | -0.5067 14 | 1.7527 15 | 0.01608 | -0.001274 | 0.00000674 | 0.000000103 | 1.2661 | d ↔ a 16 VR | 19378.44 Z |
↳missing citation; Bugrim, Lyutyi, et al., 1965; missing citation; Phillips and Davis, 1968 | ||||||||||||
(d ← X) 17 | ||||||||||||
c 3Σu+ | 13312.1 | 1961.6 18 | 13.7 | 1.87 18 | 1.23 | |||||||
A 1Πu | 8391.00 | 1608.35 Z | 12.078 | -0.0119 | 1.6134 20 | 0.01686 19 | -0.000054 | 0.00000644 19 | 0.000000036 | 1.31843 | A ↔ X 21 R | 8268.16 Z |
↳Ballik and Ramsay, 1963 | ||||||||||||
State | Te | ωe | ωexe | ωeye | Be | αe | γe | De | βe | re | Trans. | ν00 |
b 3Σg- | 6434.27 | 1470.45 Z | 11.19 | 0.028 22 | 1.49852 23 | 0.01634 | -0.000087 24 | 0.00000622 | 1.36928 | b → a 25 R | 5632.7 Z | |
↳missing citation | ||||||||||||
a 3Πu | 716.24 26 | 1641.35 Z | 11.67 | 1.63246 27 | 0.01661 | 0.00000644 | 1.31190 | |||||
X 1Σg+ | 0 | 1854.71 Z | 13.340 28 | -0.172 28 | 1.81984 | 0.01765 28 | -0.00023 | 0.00000692 28 | 0.000000081 | 1.24253 |

References

Chase, 1998
Chase, M.W., Jr.,
NIST-JANAF Themochemical Tables, Fourth Edition,
J. Phys. Chem. Ref. Data, Monograph 9, 1998, 1-1951. [all data]
Zhou, Garand, et al., 2007
Zhou, J.; Garand, E.; Neumark, D.M.,
Vibronic structure in C2H and C2D from anion slow electron velocity-map imaging spectroscopy,
J. Chem. Phys., 2007, 127, 11, 114313, https://doi.org/10.1063/1.2768932
. [all data]
Ruscic and Berkowitz, 1990
Ruscic, B.; Berkowitz, J.,
Photoion-pair Formation and Photoelectron-induced Dissociative Attachment in C2H2: D0(HCC-H),
J. Chem. Phys., 1990, 93, 8, 5586, https://doi.org/10.1063/1.459629
. [all data]
Gurvich, Veyts, et al.
Gurvich, L.V.; Veyts, I.V.; Alcock, C.B.,
Hemisphere Publishing, NY, 1989, V. 1 2, Thermodynamic Properties of Individual Substances, 4th Ed. [all data]
Bartmess, Scott, et al., 1979
Bartmess, J.E.; Scott, J.A.; McIver, R.T., Jr.,
The gas phase acidity scale from methanol to phenol,
J. Am. Chem. Soc., 1979, 101, 6047. [all data]
Radi, Rincon, et al., 1989
Radi, P.P.; Rincon, M.E.; Hsu, M.T.; Brodbelt-Lustig, J.; Kemper, P.; Bowers, M.T.,
Structure, Reactivity and Energetics of Covalently Bound Carbon Cluster Ions, C5+ to C11+: Experiment and Theory,
J. Phys. Chem., 1989, 93, 16, 6187, https://doi.org/10.1021/j100353a045
. [all data]
Radi, Hsu, et al., 1990
Radi, P.R.; Hsu, M.T.; Rincon, M.E.; Kemper, P.R.; Bowers, M.T.,
On the Structure, Reactivity and Relative Stability of the Large Carbon Cluster Ions C62+, C60+ and C58+,
Chem. Phys. Lett., 1990, 174, 3-4, 223, https://doi.org/10.1016/0009-2614(90)85336-B
. [all data]