titanium carbide

Condensed phase thermochemistry data

Quantity Value Units Method Reference Comment
Δfliquid-108.33kJ/molReviewChase, 1998Data last reviewed in June, 1968
Quantity Value Units Method Reference Comment
liquid,1 bar47.38J/mol*KReviewChase, 1998Data last reviewed in June, 1968
Quantity Value Units Method Reference Comment
Δfsolid-184.10kJ/molReviewChase, 1998Data last reviewed in June, 1968
Quantity Value Units Method Reference Comment
solid24.21J/mol*KReviewChase, 1998Data last reviewed in June, 1968

Liquid Phase Heat Capacity (Shomate Equation)

Cp° = A + B*t + C*t2 + D*t3 + E/t2
H° − H°298.15= A*t + B*t2/2 + C*t3/3 + D*t4/4 − E/t + F − H
S° = A*ln(t) + B*t + C*t2/2 + D*t3/3 − E/(2*t2) + G
    Cp = heat capacity (J/mol*K)
    H° = standard enthalpy (kJ/mol)
    S° = standard entropy (J/mol*K)
    t = temperature (K) / 1000.

View plot Requires a JavaScript / HTML 5 canvas capable browser.

View table.

Temperature (K) 3290. - 4500.
A 62.76230
B -0.001173
C 0.000225
D -0.000015
E -0.003425
F -146.8340
G 95.72310
H -108.3340
ReferenceChase, 1998
Comment Data last reviewed in June, 1968

Solid Phase Heat Capacity (Shomate Equation)

Cp° = A + B*t + C*t2 + D*t3 + E/t2
H° − H°298.15= A*t + B*t2/2 + C*t3/3 + D*t4/4 − E/t + F − H
S° = A*ln(t) + B*t + C*t2/2 + D*t3/3 − E/(2*t2) + G
    Cp = heat capacity (J/mol*K)
    H° = standard enthalpy (kJ/mol)
    S° = standard entropy (J/mol*K)
    t = temperature (K) / 1000.

View plot Requires a JavaScript / HTML 5 canvas capable browser.

View table.

Temperature (K) 298. - 1000.1000. - 3290.
A 5.55433043.27000
B 149.86504.533360
C -171.06902.021400
D 67.13540-0.203272
E -0.2691361.701881
F -191.9420-195.8940
G -8.25384173.95100
H -184.0960-184.0960
ReferenceChase, 1998Chase, 1998
Comment Data last reviewed in June, 1968 Data last reviewed in June, 1968

References

Chase, 1998
Chase, M.W., Jr., NIST-JANAF Themochemical Tables, Fourth Edition, J. Phys. Chem. Ref. Data, Monograph 9, 1998, 1-1951. [all data]