Ethanol, 2-(2,4-dichlorophenoxy)-
- Formula: C8H8Cl2O2
- Molecular weight: 207.054
- IUPAC Standard InChIKey: PCCMNBRZMKANQD-UHFFFAOYSA-N
- CAS Registry Number: 120-67-2
- Chemical structure:
View 3d structure (requires JavaScript / HTML 5) - Other names: o,p-Dichlorophenoxyethanol; 2-(2,4-Dichlorophenoxy)ethanol; 2,4-Dichlorophenoxyethanol; 2-(2',4'-Dichlorophenoxy) ethanol; Cellosolve, 2,4-dichlorophenyl-; 2,4-Dichlorophenyl cellosolve

Phase change data

Data compiled as indicated in comments:
TRC - Thermodynamics Research Center, NIST Boulder Laboratories, Chris Muzny director
AC - William E. Acree, Jr., James S. Chickos
Quantity | Value | Units | Method | Reference | Comment |
---|---|---|---|---|---|
Tfus | 327. | K | N/A | McDonald, Shrader, et al., 1959 | Uncertainty assigned by TRC = 3. K; TRC |
Enthalpy of vaporization
ΔvapH (kJ/mol) | Temperature (K) | Method | Reference | Comment |
---|---|---|---|---|
65.1 | 499. | A | McDonald, Shrader, et al., 1959, 2 | Based on data from 484. to 560. K. See also Boublik, Fried, et al., 1984.; AC |
Antoine Equation Parameters
log10(P) = A − (B / (T + C))
P = vapor pressure (bar)
T = temperature (K)
View plot Requires a JavaScript / HTML 5 canvas capable browser.
Temperature (K) | A | B | C | Reference |
---|---|---|---|---|
484.63 to 559.4 | 4.40272 | 2035.22 | -112.779 | McDonald, Shrader, et al., 1959, 2 |

References

McDonald, Shrader, et al., 1959
McDonald, R.A.; Shrader, S.A.; Stull, D.R.,
Vapor Pressures and Freezing Points of 30 Organics,
J. Chem. Eng. Data, 1959, 4, 311. [all data]
McDonald, Shrader, et al., 1959, 2
McDonald, R.A.; Shrader, S.A.; Stull, D.R.,
Vapor Pressures and Freezing Points of Thirty Pure Organic Compounds.,
J. Chem. Eng. Data, 1959, 4, 4, 311-313, https://doi.org/10.1021/je60004a009
. [all data]
Boublik, Fried, et al., 1984
Boublik, T.; Fried, V.; Hala, E.,
The Vapour Pressures of Pure Substances: Selected Values of the Temperature Dependence of the Vapour Pressures of Some Pure Substances in the Normal and Low Pressure Region, 2nd ed., Elsevier, New York, 1984, 972. [all data]