Piperonal
- Formula: C8H6O3
- Molecular weight: 150.1314
- IUPAC Standard InChIKey: SATCULPHIDQDRE-UHFFFAOYSA-N
- CAS Registry Number: 120-57-0
- Chemical structure:
View 3d structure (requires JavaScript / HTML 5) - Other names: 1,3-Benzodioxole-5-carboxaldehyde; Geliotropin; Heliotropin; Heliotropine; Piperonaldehyde; Piperonylaldehyde; Protocatechuic aldehyde methylene ether; 3,4-(Methylenedioxy)benzaldehyde; 3,4-Bis(methylenedioxy)benzaldehyde; 3,4-Dihydroxybenzaldehyde methylene ketal; 5-Formyl-1,3-benzodioxole; Benzaldehyde, 3,4-(methylenedioxy)-; Dioxymethylene-protocatechuic aldehyde; 3,4-Methylene-dihydroxybenzaldehyde; 3,4-Dimethylenedioxybenzaldehyde; NSC 26826; Piperanal; 1,3-Benzodioxole-5-carbaldehyde; Heliotropine (Piperonal)

Condensed phase thermochemistry data

Data compiled by: Hussein Y. Afeefy, Joel F. Liebman, and Stephen E. Stein
Quantity | Value | Units | Method | Reference | Comment |
---|---|---|---|---|---|
ΔfH°solid | -363. | kJ/mol | Ccb | Zavoianu, Contineanu, et al., 1986 | |
Quantity | Value | Units | Method | Reference | Comment |
ΔcH°solid | -3645. | kJ/mol | Ccb | Zavoianu, Contineanu, et al., 1986 | Corresponding ΔfHºsolid = -361. kJ/mol (simple calculation by NIST; no Washburn corrections) |

Phase change data

Data compiled as indicated in comments:
BS - Robert L. Brown and Stephen E. Stein
TRC - Thermodynamics Research Center, NIST Boulder Laboratories, Chris Muzny director
AC - William E. Acree, Jr., James S. Chickos
Quantity | Value | Units | Method | Reference | Comment |
---|---|---|---|---|---|
Tboil | 536.2 | K | N/A | Weast and Grasselli, 1989 | BS |
Tboil | 535. to 537. | K | N/A | Frinton Laboratories Inc., 1986 | BS |
Quantity | Value | Units | Method | Reference | Comment |
Tfus | 310.25 | K | N/A | Serpinskii, Voitkevich, et al., 1958 | Uncertainty assigned by TRC = 1. K; TRC |
Reduced pressure boiling point
Tboil (K) | Pressure (bar) | Reference | Comment |
---|---|---|---|
413.2 | 0.020 | Weast and Grasselli, 1989 | BS |
Enthalpy of vaporization
ΔvapH (kJ/mol) | Temperature (K) | Method | Reference | Comment |
---|---|---|---|---|
60.6 | 375. | A | Stephenson and Malanowski, 1987 | Based on data from 360. to 536. K. See also Stull, 1947.; AC |
65.7 | 331. | N/A | Serpinskii, Voitkevich, et al., 1953 | Based on data from 310. to 353. K.; AC |
Antoine Equation Parameters
log10(P) = A − (B / (T + C))
P = vapor pressure (bar)
T = temperature (K)
View plot Requires a JavaScript / HTML 5 canvas capable browser.
Temperature (K) | A | B | C | Reference | Comment |
---|---|---|---|---|---|
360. to 536. | 5.25051 | 2608.988 | -39.07 | Stull, 1947 | Coefficents calculated by NIST from author's data. |
Enthalpy of sublimation
ΔsubH (kJ/mol) | Temperature (K) | Reference | Comment |
---|---|---|---|
90.8 | 323. | Serpinskii, Voitkevich, et al., 1953 | Based on data from 293. to 353. K. See also Jones, 1960 and Stephenson and Malanowski, 1987.; AC |

Kovats' RI, non-polar column, isothermal

Column type | Active phase | Temperature (C) | I | Reference | Comment |
---|---|---|---|---|---|
Capillary | SE-30 | 100. | 1292.2 | Tudor, 1997 | 40. m/0.35 mm/0.35 μm |

Kovats' RI, non-polar column, temperature ramp

Column type | Active phase | I | Reference | Comment |
---|---|---|---|---|
Capillary | CP Sil 8 CB | 1347. | Tayoub, Schwob, et al., 2006 | 30. m/0.25 mm/0.25 μm, H2, 50. C @ 2. min, 3. K/min; Tend: 220. C |
Capillary | CP Sil 8 CB | 1347. | Tayoub, Schwob, et al., 2006, 2 | 30. m/0.25 mm/0.25 μm, H2, 50. C @ 2. min, 3. K/min; Tend: 220. C |

Van Den Dool and Kratz RI, non-polar column, temperature ramp

Column type | Active phase | I | Reference | Comment |
---|---|---|---|---|
Capillary | CP-Sil PONA GB | 1305. | Cunicao, Lopes, et al., 2007 | 100. m/0.25 mm/0.25 μm, He, 140. C @ 10. min, 5. K/min, 230. C @ 25. min |
Capillary | HP-5 | 1333. | Mahattanatawee, Goodner, et al., 2005 | 30. m/0.25 mm/0.25 μm, He, 50. C @ 5. min, 4. K/min, 250. C @ 15. min |
Capillary | HP-5 | 1329. | Mahattanatawee, Goodner, et al., 2005 | 30. m/0.25 mm/0.25 μm, He, 50. C @ 5. min, 4. K/min, 250. C @ 15. min |
Capillary | HP-5MS | 1329. | Pino, Mesa, et al., 2005 | 30. m/0.25 mm/0.25 μm, He, 60. C @ 2. min, 4. K/min, 250. C @ 20. min |
Capillary | DB-1 | 1285.1 | Chang, Sheng, et al., 1989 | 2. K/min; Column length: 30. m; Column diameter: 0.25 mm; Tstart: 50. C; Tend: 300. C |
Capillary | DB-1 | 1285.4 | Chang, Sheng, et al., 1989 | 2. K/min; Column length: 30. m; Column diameter: 0.25 mm; Tstart: 50. C; Tend: 300. C |

Van Den Dool and Kratz RI, non-polar column, custom temperature program

Column type | Active phase | I | Reference | Comment |
---|---|---|---|---|
Capillary | SE-54 | 1329. | Jagella and Grosch, 1999 | 30. m/0.32 mm/0.25 μm, He; Program: 35C(2min) => 40C/min => 65C => 6C/min => 250C |
Capillary | RTX-5 | 1330. | Jagella and Grosch, 1999 | 30. m/0.32 mm/0.25 μm, He; Program: 35C(2min) => 40C/min => 65C => 6C/min => 250C |

Van Den Dool and Kratz RI, polar column, temperature ramp

Column type | Active phase | I | Reference | Comment |
---|---|---|---|---|
Capillary | DB-Wax | 2211.0 | Chang, Sheng, et al., 1989 | 2. K/min; Column length: 30. m; Column diameter: 0.25 mm; Tstart: 50. C; Tend: 240. C |
Capillary | DB-Wax | 2213.7 | Chang, Sheng, et al., 1989 | 2. K/min; Column length: 30. m; Column diameter: 0.25 mm; Tstart: 50. C; Tend: 240. C |

Van Den Dool and Kratz RI, polar column, custom temperature program

Column type | Active phase | I | Reference | Comment |
---|---|---|---|---|
Capillary | FFAP | 2244. | Jagella and Grosch, 1999 | 30. m/0.32 mm/0.25 μm, He; Program: 40C(1min) => 40C/min => 60C => 6C/min => 230C |

Normal alkane RI, non-polar column, temperature ramp

Column type | Active phase | I | Reference | Comment |
---|---|---|---|---|
Capillary | SE-54 | 1322. | Kollmannsberger, Nitz, et al., 1992 | 30. m/0.25 mm/0.25 μm, Hydrogen, 60. C @ 5. min, 2. K/min, 250. C @ 2. min |

Normal alkane RI, non-polar column, custom temperature program

Column type | Active phase | I | Reference | Comment |
---|---|---|---|---|
Capillary | DB-5 | 1329. | Yusuf and Bewaji, 2011 | Helium; Column length: 30. m; Column diameter: 0.32 mm; Program: not specified |
Capillary | DB-5 | 1334. | Steinhaus and Schieberle, 2005 | 30. m/0.32 mm/0.25 μm, He; Program: 40 0C (2 min) 6 K/min -> 190 0C 12 K/min -> 240 0C |
Capillary | SE-30 | 1370. | Vinogradov, 2004 | Program: not specified |
Other | Methyl Silicone | 1305. | Ardrey and Moffat, 1981 | Program: not specified |

Normal alkane RI, polar column, temperature ramp

Column type | Active phase | I | Reference | Comment |
---|---|---|---|---|
Capillary | Carbowax 20M | 2183. | Kollmannsberger, Nitz, et al., 1992 | 45. m/0.32 mm/1.0 μm, Hydrogen, 60. C @ 5. min, 2. K/min; Tend: 200. C |

Normal alkane RI, polar column, custom temperature program

Column type | Active phase | I | Reference | Comment |
---|---|---|---|---|
Capillary | DB-Wax | 2225. | Steinhaus and Schieberle, 2005 | 30. m/0.32 mm/0.25 μm, He; Program: 40 0C (2 min) 6 K/min -> 190 0C 12 K/min -> 240 0C |
Capillary | Carbowax 20M | 2171. | Vinogradov, 2004 | Program: not specified |

References

Zavoianu, Contineanu, et al., 1986
Zavoianu, D.; Contineanu, I.; Moga-Gheorghe, S.; Marchidan, D.,
Structure and reactivity of nitriles. Condensation reaction of phenylacetonitrile with benzaldehydes,
Rev. Chim. (Bucharest), 1986, 37, 1055-1058. [all data]
Weast and Grasselli, 1989
CRC Handbook of Data on Organic Compounds, 2nd Editon, Weast,R.C and Grasselli, J.G., ed(s)., CRC Press, Inc., Boca Raton, FL, 1989, 1. [all data]
Frinton Laboratories Inc., 1986
Frinton Laboratories Inc.,
Catalog Number 11, Frinton Laboratories Inc., Vineland, NJ, 1986, 99. [all data]
Serpinskii, Voitkevich, et al., 1958
Serpinskii, V.V.; Voitkevich, S.A.; Lyuboshits, N.Yu.,
Trudy Vsesoyuz. Nauch.-Issledovatel. Inst. Sintet. I. Natural. Dushistykh Veshchestv, 1958, 4, 125. [all data]
Stephenson and Malanowski, 1987
Stephenson, Richard M.; Malanowski, Stanislaw,
Handbook of the Thermodynamics of Organic Compounds, 1987, https://doi.org/10.1007/978-94-009-3173-2
. [all data]
Stull, 1947
Stull, Daniel R.,
Vapor Pressure of Pure Substances. Organic and Inorganic Compounds,
Ind. Eng. Chem., 1947, 39, 4, 517-540, https://doi.org/10.1021/ie50448a022
. [all data]
Serpinskii, Voitkevich, et al., 1953
Serpinskii, V.V.; Voitkevich, S.A.; Lyuboshits, N.Y.,
Zh. Fiz. Khim., 1953, 27, 1032. [all data]
Jones, 1960
Jones, A.H.,
Sublimation Pressure Data for Organic Compounds.,
J. Chem. Eng. Data, 1960, 5, 2, 196-200, https://doi.org/10.1021/je60006a019
. [all data]
Lang (editor), 1972
Lang (editor), L.,
Absorption Spectra in the Ultraviolet and Visible Region, 1972, 16, 171. [all data]
Tudor, 1997
Tudor, E.,
Temperature dependence of the retention index for perfumery compounds on a SE-30 glass capillary column. I. Linear equations,
J. Chromatogr. A, 1997, 779, 1-2, 287-297, https://doi.org/10.1016/S0021-9673(97)00453-6
. [all data]
Tayoub, Schwob, et al., 2006
Tayoub, G.; Schwob, I.; Bessiere, J.-M.; Masotti, V.; Rabier, J.; Ruzzier, M.; Viano, J.,
Composition of volatile oils of Styrax (Styrax officinalis L.) leaves at different phenological stages,
Biochem. Syst. Ecol., 2006, 34, 9, 705-709, https://doi.org/10.1016/j.bse.2006.05.008
. [all data]
Tayoub, Schwob, et al., 2006, 2
Tayoub, G.; Schwob, I.; Bessière, J.-M.; Rabier, J.; Masotti, V.; J.; M.; Girard, G.; Viano, J.,
Essential oil composition of leaf, flower and stem of Styrax (Styrax officinalis L.) from south-eastern France,
Flavour Fragr. J., 2006, 21, 5, 809-812, https://doi.org/10.1002/ffj.1731
. [all data]
Cunicao, Lopes, et al., 2007
Cunicao, M.M.; Lopes, A.R.; Côcco, L.C.; Yamamoto, C.I.; Plocharski, R.C.B.; Miguel, M.D.; Junior, A.G.; Auer, C.G.; Miguel, O.G.,
Phytochemical and antibacterial evaluation of essential oils from Ottonia Martiana Miq. (Piperaceae),
J. Braz. Chem. Soc., 2007, 18, 1, 184-188, https://doi.org/10.1590/S0103-50532007000100021
. [all data]
Mahattanatawee, Goodner, et al., 2005
Mahattanatawee, K.; Goodner, K.L.; Baldwin, E.A.,
Volatile constituents and character impact compounds of selected Florida's tropical fruit,
Proc. Fla. State Hort. Soc., 2005, 118, 414-418. [all data]
Pino, Mesa, et al., 2005
Pino, J.A.; Mesa, J.; Muñoz, Y.; Martí, M.P.; Marbot, R.,
Volatile components from mango (Mangifera indica L.) cultivars,
J. Agric. Food Chem., 2005, 53, 6, 2213-2223, https://doi.org/10.1021/jf0402633
. [all data]
Chang, Sheng, et al., 1989
Chang, L.P.; Sheng, L.S.; Yang, M.Z.; An, D.K.,
Retention index of essential oil in temperature-programmed capillary column gas chromatography,
Acta Pharm. Sin., 1989, 24, 11, 847-852. [all data]
Jagella and Grosch, 1999
Jagella, T.; Grosch, W.,
Flavour and off-flavour compounds of black and white pepper ( Piper nigrum L.) I. Evaluation of potent odorants of black pepper by dilution and concentration techniques,
Eur. Food Res. Technol., 1999, 209, 1, 16-21, https://doi.org/10.1007/s002170050449
. [all data]
Kollmannsberger, Nitz, et al., 1992
Kollmannsberger, H.; Nitz, S.; Drawert, F.,
UBer die Aromastoffzusammensetzung von Hochdruckextrakten. I. Pfeffer (Piper nigrum, Var. muntok),
Z. Lebensm. Unters Forsch., 1992, 194, 6, 545-551, https://doi.org/10.1007/BF01185481
. [all data]
Yusuf and Bewaji, 2011
Yusuf, O.K.; Bewaji, C.O.,
GC-MS of volatile components of fermented wheat germ extract,
J. Cereals Oilseeds, 2011, 2, 3, 38-42. [all data]
Steinhaus and Schieberle, 2005
Steinhaus, M.; Schieberle, P.,
Characterization of odorants causing an atypical aroma in white pepper powder (Piper nigrum L.) based on quantitative measurements and orthonasal breakthrough thresholds,
J. Agric. Food Chem., 2005, 53, 15, 6049-6055, https://doi.org/10.1021/jf0506030
. [all data]
Vinogradov, 2004
Vinogradov, B.A.,
Production, composition, properties and application of essential oils, 2004, retrieved from http://viness.narod.ru. [all data]
Ardrey and Moffat, 1981
Ardrey, R.E.; Moffat, A.C.,
Gas-liquid chromatographic retention indices of 1318 substances of toxicological interest on SE-30 or OV-1 stationary phase,
J. Chromatogr., 1981, 220, 3, 195-252, https://doi.org/10.1016/S0021-9673(00)81925-1
. [all data]