Ethylparaben
- Formula: C9H10O3
- Molecular weight: 166.1739
- IUPAC Standard InChIKey: NUVBSKCKDOMJSU-UHFFFAOYSA-N
- CAS Registry Number: 120-47-8
- Chemical structure:
View 3d structure (requires JavaScript / HTML 5) - Other names: Benzoic acid, 4-hydroxy-, ethyl ester; Benzoic acid, p-hydroxy-, ethyl ester; p-Carbethoxyphenol; p-Hydroxybenzoate ethyl ester; p-Hydroxybenzoic acid ethyl ester; Aseptoform E; Bonomold OE; Easeptol; Ethyl p-hydroxybenzoate; Ethyl parasept; Ethyl Butex; Ethyl 4-hydroxybenzoate; Mycocten; Napagin A; Nipagin A; Nipazin A; Sobrol A; Solbrol A; Tegosept E; 4-Hydroxybenzoic acid, ethyl ester; Ethyl para-hydroxybenzoate; Ester etylowykwasu p-hydroksybenzoesowego; Ethylester kyseliny p-hydroxybenzoove; Ethyl p-oxybenzoate; Nipagina A; p-Oxybenzoesaeureaethylester; 4-(Ethoxycarbonyl)phenol; 4-Carbethoxyphenol; Aseptin A; Aseptine A; Para-hydroxybenzoic acid ethyl ester; Mekkings E; NSC 23514

Phase change data

Data compiled as indicated in comments:
BS - Robert L. Brown and Stephen E. Stein
AC - William E. Acree, Jr., James S. Chickos
Quantity | Value | Units | Method | Reference | Comment |
---|---|---|---|---|---|
Tboil | 570.7 | K | N/A | Weast and Grasselli, 1989 | BS |
Quantity | Value | Units | Method | Reference | Comment |
ΔfusH° | 100.9 ± 0.7 | kJ/mol | GS | Perlovich, Rodionov, et al., 2005 | Based on data from 313. to 326. K.; AC |
Enthalpy of fusion
ΔfusH (kJ/mol) | Temperature (K) | Method | Reference | Comment |
---|---|---|---|---|
32.49 | 388.9 | DSC | Nicoli, Bilzi, et al., 2008 | AC |
27.9 | 389.2 | DSC | Wassvik, Holmén, et al., 2008 | AC |
26.4 | 389. | N/A | Giordano, Bettini, et al., 1999 | AC |

Van Den Dool and Kratz RI, non-polar column, temperature ramp

Column type | Active phase | I | Reference | Comment |
---|---|---|---|---|
Capillary | Ultra-1 | 1467. | Tokuda, Saitoh, et al., 1988 | 12.5 m/0.20 mm/0.11 μm, He, 5. K/min, 325. C @ 5. min; Tstart: 120. C |

References

Weast and Grasselli, 1989
CRC Handbook of Data on Organic Compounds, 2nd Editon, Weast,R.C and Grasselli, J.G., ed(s)., CRC Press, Inc., Boca Raton, FL, 1989, 1. [all data]
Perlovich, Rodionov, et al., 2005
Perlovich, German L.; Rodionov, Sergey V.; Bauer-Brandl, Annette,
Thermodynamics of solubility, sublimation and solvation processes of parabens,
European Journal of Pharmaceutical Sciences, 2005, 24, 1, 25-33, https://doi.org/10.1016/j.ejps.2004.09.007
. [all data]
Nicoli, Bilzi, et al., 2008
Nicoli, S.; Bilzi, S.; Santi, P.; Caira, M.R.; Li, J.; Bettini, R.,
Ethyl-paraben and nicotinamide mixtures: Apparent solubility, thermal behavior and X-ray structure of the 1:1 co-crystal,
J. Pharm. Sci., 2008, 97, 11, 4830-4839, https://doi.org/10.1002/jps.21341
. [all data]
Wassvik, Holmén, et al., 2008
Wassvik, Carola M.; Holmén, Anders G.; Draheim, Rieke; Artursson, Per; Bergström, Christel A.S.,
Molecular Characteristics for Solid-State Limited Solubility,
J. Med. Chem., 2008, 51, 10, 3035-3039, https://doi.org/10.1021/jm701587d
. [all data]
Giordano, Bettini, et al., 1999
Giordano, Ferdinando; Bettini, Ruggero; Donini, Cristina; Gazzaniga, Andrea; Caira, Mino R.; Zhang, Geoffrey G.Z.; Grant, David J.W.,
Physical properties of parabens and their mixtures: Solubility in water, thermal behavior, and crystal structures,
J. Pharm. Sci., 1999, 88, 11, 1210-1216, https://doi.org/10.1021/js9900452
. [all data]