zirconium diboride

Condensed phase thermochemistry data

Quantity Value Units Method Reference Comment
Δfliquid-224.83kJ/molReviewChase, 1998Data last reviewed in June, 1965
Quantity Value Units Method Reference Comment
liquid,1 bar64.68J/mol*KReviewChase, 1998Data last reviewed in June, 1965
Quantity Value Units Method Reference Comment
Δfsolid-322.59kJ/molReviewChase, 1998Data last reviewed in June, 1965
Quantity Value Units Method Reference Comment
solid35.84J/mol*KReviewChase, 1998Data last reviewed in June, 1965

Liquid Phase Heat Capacity (Shomate Equation)

Cp° = A + B*t + C*t2 + D*t3 + E/t2
H° − H°298.15= A*t + B*t2/2 + C*t3/3 + D*t4/4 − E/t + F − H
S° = A*ln(t) + B*t + C*t2/2 + D*t3/3 − E/(2*t2) + G
    Cp = heat capacity (J/mol*K)
    H° = standard enthalpy (kJ/mol)
    S° = standard entropy (J/mol*K)
    t = temperature (K) / 1000.

View plot Requires a JavaScript / HTML 5 canvas capable browser.

View table.

Temperature (K) 3323. - 5000.
A 96.23200
B 2.584833×10-7
C -5.580326×10-8
D 4.183004×10-9
E 4.645160×10-7
F -296.9163
G 126.0974
H -224.8323
ReferenceChase, 1998
Comment Data last reviewed in June, 1965

Solid Phase Heat Capacity (Shomate Equation)

Cp° = A + B*t + C*t2 + D*t3 + E/t2
H° − H°298.15= A*t + B*t2/2 + C*t3/3 + D*t4/4 − E/t + F − H
S° = A*ln(t) + B*t + C*t2/2 + D*t3/3 − E/(2*t2) + G
    Cp = heat capacity (J/mol*K)
    H° = standard enthalpy (kJ/mol)
    S° = standard entropy (J/mol*K)
    t = temperature (K) / 1000.

View plot Requires a JavaScript / HTML 5 canvas capable browser.

View table.

Temperature (K) 298. - 3323.
A 66.96241
B 5.665010
C 1.433879
D -0.151665
E -1.835999
F -349.0025
G 104.8013
H -322.5864
ReferenceChase, 1998
Comment Data last reviewed in June, 1965

References

Chase, 1998
Chase, M.W., Jr., NIST-JANAF Themochemical Tables, Fourth Edition, J. Phys. Chem. Ref. Data, Monograph 9, 1998, 1-1951. [all data]