Dichlorprop
- Formula: C9H8Cl2O3
- Molecular weight: 235.064
- IUPAC Standard InChIKey: MZHCENGPTKEIGP-UHFFFAOYSA-N
- CAS Registry Number: 120-36-5
- Chemical structure:
View 3d structure (requires JavaScript / HTML 5) - Other names: Propanoic acid, 2-(2,4-dichlorophenoxy)-; Propionic acid, 2-(2,4-dichlorophenoxy)-; α-(2,4-Dichlorophenoxy)propionic acid; Celatox-DP; Cornox RK; Dichloroprop; Hedonal DP; Herbizid DP; 2-(2,4-Dichlorophenoxy)propionic acid; 2-(2,4-DP); 2,4-Dichlorophenoxy-α-propionic acid; 2,4-DP; Acide 2-(2,4-dichloro-phenoxy)propionique; Acido 2-(2,4-dicloro-fenossi)-propionico; Cornox rd; Hormatox; Kildip; Polymone; Polytox; RD 406; Seritox 50; 2-(2,4-Dichloor-fenoxy)-propionzuur; 2-(2,4-Dichlor-phenoxy)-propionsaeure; BH 2,4-DP; Desormone; Kwas 2,4-dwuchlorofenoksypropionowy; Kyselina 2-(2,4-dichlorfenoxy)propionova; Polyclene; U46 DP-FLUID; Weedone DP; Weedone 170; MSS 2,4-DP; Alpha-(2,4-dichlorophenoxy)propionic acid; (.+/-.)-2,4-DP; (.+/-.)-2-(2,4-Dichlorophenoxy)propanoic acid; (.+/-.)-2-(2,4-Dichlorophenoxy)propionic acid; (.+/-.)-Dichlorprop; AF 302; Canapur DP; NSC 39624; 2-(2,4-Dichlorophenoxy)propanoic acid

Phase change data

Data compiled as indicated in comments:
TRC - Thermodynamics Research Center, NIST Boulder Laboratories, Chris Muzny director
AC - William E. Acree, Jr., James S. Chickos
Quantity | Value | Units | Method | Reference | Comment |
---|---|---|---|---|---|
Tfus | 389.64 | K | N/A | Donnelly, Drewes, et al., 1990 | Uncertainty assigned by TRC = 0.2 K; TRC |
Tfus | 389.9 | K | N/A | Plato, 1972 | Uncertainty assigned by TRC = 0.2 K; TRC |
Quantity | Value | Units | Method | Reference | Comment |
ΔsubH° | 116. ± 6. | kJ/mol | DSC | Vecchio and Brunetti, 2005 | AC |
ΔsubH° | 130. ± 3. | kJ/mol | TE | Vecchio and Brunetti, 2005 | Based on data from 343. to 375. K.; AC |
Enthalpy of sublimation
ΔsubH (kJ/mol) | Temperature (K) | Method | Reference | Comment |
---|---|---|---|---|
128. ± 2. | 359. | TE | Vecchio and Brunetti, 2005 | Based on data from 343. to 375. K.; AC |
Enthalpy of fusion
ΔfusH (kJ/mol) | Temperature (K) | Method | Reference | Comment |
---|---|---|---|---|
32.0 | 391.3 | DSC | Vecchio and Brunetti, 2005 | AC |
30.43 | 389.2 | N/A | Acree, 1991 | AC |

Kovats' RI, non-polar column, custom temperature program

Column type | Active phase | I | Reference | Comment |
---|---|---|---|---|
Packed | SE-30 | 1756. | Osselton and Snelling, 1986 | N2, Chromosorb W HP; Column length: 2. m; Program: not specified |

References

Donnelly, Drewes, et al., 1990
Donnelly, J.R.; Drewes, L.A.; Johnson, R.L.; Munslow, W.D.; Knapp, K.K.; Sovocool, G.W.,
Purity and heat of fusion data for environmental standards as determined by differential scanning calorimetry,
Thermochim. Acta, 1990, 167, 2, 155, https://doi.org/10.1016/0040-6031(90)80476-F
. [all data]
Plato, 1972
Plato, C.,
DSC as a general method for determining purity and heat of fusion of high-purity organic chemicals,
Anal. Chem., 1972, 44, 1531. [all data]
Vecchio and Brunetti, 2005
Vecchio, Stefano; Brunetti, Bruno,
Standard Sublimation Enthalpies of Some Dichlorophenoxy Acids and Their Methyl Esters,
J. Chem. Eng. Data, 2005, 50, 2, 666-672, https://doi.org/10.1021/je049626l
. [all data]
Acree, 1991
Acree, William E.,
Thermodynamic properties of organic compounds: enthalpy of fusion and melting point temperature compilation,
Thermochimica Acta, 1991, 189, 1, 37-56, https://doi.org/10.1016/0040-6031(91)87098-H
. [all data]
Osselton and Snelling, 1986
Osselton, M.D.; Snelling, R.D.,
Chromatographic Identification of Pesticides,
J. Chromatogr., 1986, 368, 265-271, https://doi.org/10.1016/S0021-9673(00)91068-9
. [all data]