niobium dioxide
- Formula: NbO2
- Molecular weight: 124.9052
- IUPAC Standard InChIKey: BJDGBXPQVFSQOZ-UHFFFAOYSA-N
- CAS Registry Number: 12034-59-2
- Chemical structure:
View 3d structure (requires JavaScript / HTML 5) - Other names: Niobium(iv) oxide

Gas phase thermochemistry data

Quantity | Value | Units | Method | Reference | Comment |
---|---|---|---|---|---|
ΔfH°gas | -200.00 | kJ/mol | Review | Chase, 1998 | Data last reviewed in December, 1973 |
Quantity | Value | Units | Method | Reference | Comment |
S°gas,1 bar | 272.78 | J/mol*K | Review | Chase, 1998 | Data last reviewed in December, 1973 |
Gas Phase Heat Capacity (Shomate Equation)
Cp° = A + B*t + C*t2 + D*t3 +
E/t2
H° − H°298.15= A*t + B*t2/2 +
C*t3/3 + D*t4/4 − E/t + F − H
S° = A*ln(t) + B*t + C*t2/2 + D*t3/3 −
E/(2*t2) + G
Cp = heat capacity (J/mol*K)
H° = standard enthalpy (kJ/mol)
S° = standard entropy (J/mol*K)
t = temperature (K) / 1000.
View plot Requires a JavaScript / HTML 5 canvas capable browser.
Temperature (K) | 3000. to 6000. |
---|---|
A | 52.84280 |
B | 4.543880 |
C | -1.230591 |
D | 0.105124 |
E | -0.973563 |
F | -219.2420 |
G | 329.9540 |
H | -199.9950 |
Reference | Chase, 1998 |
Comment | Data last reviewed in December, 1973 |

References

Chase, 1998
Chase, M.W., Jr.,
NIST-JANAF Themochemical Tables, Fourth Edition,
J. Phys. Chem. Ref. Data, Monograph 9, 1998, 1-1951. [all data]