magnesium titanate

Condensed phase thermochemistry data

Quantity Value Units Method Reference Comment
Δfliquid-1497.63kJ/molReviewChase, 1998Data last reviewed in June, 1967
Quantity Value Units Method Reference Comment
liquid,1 bar111.05J/mol*KReviewChase, 1998Data last reviewed in June, 1967
Quantity Value Units Method Reference Comment
Δfsolid-1572.56kJ/molReviewChase, 1998Data last reviewed in June, 1967
Quantity Value Units Method Reference Comment
solid74.39J/mol*KReviewChase, 1998Data last reviewed in June, 1967

Liquid Phase Heat Capacity (Shomate Equation)

Cp° = A + B*t + C*t2 + D*t3 + E/t2
H° − H°298.15= A*t + B*t2/2 + C*t3/3 + D*t4/4 − E/t + F − H
S° = A*ln(t) + B*t + C*t2/2 + D*t3/3 − E/(2*t2) + G
    Cp = heat capacity (J/mol*K)
    H° = standard enthalpy (kJ/mol)
    S° = standard entropy (J/mol*K)
    t = temperature (K) / 1000.

View plot Requires a JavaScript / HTML 5 canvas capable browser.

View table.

Temperature (K) 1953. - 4000.
A 163.1760
B 1.979598×10-7
C -6.021027×10-8
D 6.235040×10-9
E 1.106166×10-7
F -1587.355
G 241.1913
H -1497.634
ReferenceChase, 1998
Comment Data last reviewed in June, 1967

Solid Phase Heat Capacity (Shomate Equation)

Cp° = A + B*t + C*t2 + D*t3 + E/t2
H° − H°298.15= A*t + B*t2/2 + C*t3/3 + D*t4/4 − E/t + F − H
S° = A*ln(t) + B*t + C*t2/2 + D*t3/3 − E/(2*t2) + G
    Cp = heat capacity (J/mol*K)
    H° = standard enthalpy (kJ/mol)
    S° = standard entropy (J/mol*K)
    t = temperature (K) / 1000.

View plot Requires a JavaScript / HTML 5 canvas capable browser.

View table.

Temperature (K) 298. - 1953.
A 110.3170
B 29.61636
C -9.651736
D 1.789456
E -2.369973
F -1614.681
G 186.1395
H -1572.556
ReferenceChase, 1998
Comment Data last reviewed in June, 1967

References

Chase, 1998
Chase, M.W., Jr., NIST-JANAF Themochemical Tables, Fourth Edition, J. Phys. Chem. Ref. Data, Monograph 9, 1998, 1-1951. [all data]