dilithium peroxide
- Formula: Li2O2
- Molecular weight: 45.881
- CAS Registry Number: 12031-80-0

Gas phase thermochemistry data

Quantity | Value | Units | Method | Reference | Comment |
---|---|---|---|---|---|
ΔfH°gas | -242.67 | kJ/mol | Review | Chase, 1998 | Data last reviewed in September, 1963 |
Quantity | Value | Units | Method | Reference | Comment |
S°gas,1 bar | 273.53 | J/mol*K | Review | Chase, 1998 | Data last reviewed in September, 1963 |
Gas Phase Heat Capacity (Shomate Equation)
Cp° = A + B*t + C*t2 + D*t3 +
E/t2
H° − H°298.15= A*t + B*t2/2 +
C*t3/3 + D*t4/4 − E/t + F − H
S° = A*ln(t) + B*t + C*t2/2 + D*t3/3 −
E/(2*t2) + G
Cp = heat capacity (J/mol*K)
H° = standard enthalpy (kJ/mol)
S° = standard entropy (J/mol*K)
t = temperature (K) / 1000.
View plot Requires a JavaScript / HTML 5 canvas capable browser.
Temperature (K) | 298. to 6000. |
---|---|
A | 82.33694 |
B | 0.689226 |
C | -0.186798 |
D | 0.015942 |
E | -0.883054 |
F | -270.2115 |
G | 368.0087 |
H | -242.6724 |
Reference | Chase, 1998 |
Comment | Data last reviewed in September, 1963 |

Condensed phase thermochemistry data

Quantity | Value | Units | Method | Reference | Comment |
---|---|---|---|---|---|
ΔfH°solid | -632.62 | kJ/mol | Review | Chase, 1998 | Data last reviewed in September, 1963 |
Quantity | Value | Units | Method | Reference | Comment |
S°solid | 56.42 | J/mol*K | Review | Chase, 1998 | Data last reviewed in September, 1963 |
Solid Phase Heat Capacity (Shomate Equation)
Cp° = A + B*t + C*t2 + D*t3 +
E/t2
H° − H°298.15= A*t + B*t2/2 +
C*t3/3 + D*t4/4 − E/t + F − H
S° = A*ln(t) + B*t + C*t2/2 + D*t3/3 −
E/(2*t2) + G
Cp = heat capacity (J/mol*K)
H° = standard enthalpy (kJ/mol)
S° = standard entropy (J/mol*K)
t = temperature (K) / 1000.
View plot Requires a JavaScript / HTML 5 canvas capable browser.
Temperature (K) | 298. to 2000. |
---|---|
A | 71.79744 |
B | 48.58837 |
C | 1.602573 |
D | -0.856984 |
E | -1.401984 |
F | -660.9256 |
G | 120.8732 |
H | -632.6208 |
Reference | Chase, 1998 |
Comment | Data last reviewed in September, 1963 |

References

Chase, 1998
Chase, M.W., Jr.,
NIST-JANAF Themochemical Tables, Fourth Edition,
J. Phys. Chem. Ref. Data, Monograph 9, 1998, 1-1951. [all data]