potassium superoxide
- Formula: KO2
- Molecular weight: 71.0971
- CAS Registry Number: 12030-88-5

Condensed phase thermochemistry data

Quantity | Value | Units | Method | Reference | Comment |
---|---|---|---|---|---|
ΔfH°solid | -68.000 | kcal/mol | Review | Chase, 1998 | Data last reviewed in June, 1971 |
Quantity | Value | Units | Method | Reference | Comment |
S°solid | 29.266 | cal/mol*K | Review | Chase, 1998 | Data last reviewed in June, 1971 |
Solid Phase Heat Capacity (Shomate Equation)
Cp° = A + B*t + C*t2 + D*t3 +
E/t2
H° − H°298.15= A*t + B*t2/2 +
C*t3/3 + D*t4/4 − E/t + F − H
S° = A*ln(t) + B*t + C*t2/2 + D*t3/3 −
E/(2*t2) + G
Cp = heat capacity (cal/mol*K)
H° = standard enthalpy (kcal/mol)
S° = standard entropy (cal/mol*K)
t = temperature (K) / 1000.
View plot Requires a JavaScript / HTML 5 canvas capable browser.
Temperature (K) | 298. to 1500. |
---|---|
A | 18.67270 |
B | 8.812350 |
C | -5.975500 |
D | 1.377451 |
E | -0.203190 |
F | -74.59450 |
G | 48.34720 |
H | -68.00010 |
Reference | Chase, 1998 |
Comment | Data last reviewed in June, 1971 |

References

Chase, 1998
Chase, M.W., Jr.,
NIST-JANAF Themochemical Tables, Fourth Edition,
J. Phys. Chem. Ref. Data, Monograph 9, 1998, 1-1951. [all data]