Acetic acid, (2-naphthalenyloxy)-
- Formula: C12H10O3
- Molecular weight: 202.2060
- IUPAC Standard InChIKey: RZCJYMOBWVJQGV-UHFFFAOYSA-N
- CAS Registry Number: 120-23-0
- Chemical structure:
View 3d structure (requires JavaScript / HTML 5) - Other names: Acetic acid, (2-naphthyloxy)-; β-Naphthoxyacetic acid; β-Naphthyloxyacetic acid; (β-Naphthalenyloxy)acetic acid; Betoxon; Gerlach 1396; Naphthoxyacetic acid; NOXA; O-(2-Naphthyl)glycolic acid; 2-Naphthoxyacetic acid; 2-Naphthyloxyacetic acid; 2-NOXA; (2-Naphthloxy)acetic acid; Bnoa; Phyomone; (beta-Naphthalenyloxy)acetic acid; (beta-Naphthyloxy)acetic acid; (2-Naphthalenyloxy)acetic acid; Betapal; Betokson; Betokson super; Acetic acid, 2-(2-naphthalenyloxy)-; NSC 2070

Phase change data

Data compiled by: Thermodynamics Research Center, NIST Boulder Laboratories, Chris Muzny director
Quantity | Value | Units | Method | Reference | Comment |
---|---|---|---|---|---|
Tfus | 429.4 | K | N/A | Plato, 1972 | Uncertainty assigned by TRC = 0.2 K |

References

Plato, 1972
Plato, C.,
DSC as a general method for determining purity and heat of fusion of high-purity organic chemicals,
Anal. Chem., 1972, 44, 1531. [all data]