Benzoic acid, 4-(dimethylamino)-, methyl ester
- Formula: C10H13NO2
- Molecular weight: 179.2157
- IUPAC Standard InChIKey: DBQGARDMYOMOOS-UHFFFAOYSA-N
- CAS Registry Number: 1202-25-1
- Chemical structure:
View 3d structure (requires JavaScript / HTML 5) - Other names: Benzoic acid, p-(dimethylamino)-, methyl ester; Methyl p-(dimethylamino)benzoate; Methyl 4-(dimethylamino)benzoate; Methyl 4-(N,N-dimethylamino)benzoate; 4-(CH3)2NC6H4COOCH3

Phase change data

Data compiled as indicated in comments:
TRC - Thermodynamics Research Center, NIST Boulder Laboratories, Chris Muzny director
AC - William E. Acree, Jr., James S. Chickos
Quantity | Value | Units | Method | Reference | Comment |
---|---|---|---|---|---|
Tfus | 371.7 | K | N/A | Manzo and Ahumanda, 1990 | Uncertainty assigned by TRC = 0.5 K; TRC |
Enthalpy of fusion
ΔfusH (kcal/mol) | Temperature (K) | Reference | Comment |
---|---|---|---|
6.231 | 371.8 | Acree, 1991 | AC |

Gas phase ion energetics data

Data evaluated by: Edward P. Hunter and Sharon G. Lias
Quantity | Value | Units | Method | Reference | Comment |
---|---|---|---|---|---|
Proton affinity (review) | 220.0 | kcal/mol | N/A | Hunter and Lias, 1998 | |
Quantity | Value | Units | Method | Reference | Comment |
Gas basicity | 213.7 | kcal/mol | N/A | Hunter and Lias, 1998 |

References

Manzo and Ahumanda, 1990
Manzo, R.H.; Ahumanda, A.A.,
Effects of solvent medium on solubility. V: Enthalpic and entropic contributions to the free energy changes of Di-substituted benzene derivatives in ethanol: Water and ethanol: Cyclohexane mixtures,
J. Pharm. Sci., 1990, 79, 12, 1109, https://doi.org/10.1002/jps.2600791214
. [all data]
Acree, 1991
Acree, William E.,
Thermodynamic properties of organic compounds: enthalpy of fusion and melting point temperature compilation,
Thermochimica Acta, 1991, 189, 1, 37-56, https://doi.org/10.1016/0040-6031(91)87098-H
. [all data]
Hunter and Lias, 1998
Hunter, E.P.; Lias, S.G.,
Evaluated Gas Phase Basicities and Proton Affinities of Molecules: An Update,
J. Phys. Chem. Ref. Data, 1998, 27, 3, 413-656, https://doi.org/10.1063/1.556018
. [all data]