Benzaldehyde, 4-(diethylamino)-
- Formula: C11H15NO
- Molecular weight: 177.2429
- IUPAC Standard InChIKey: MNFZZNNFORDXSV-UHFFFAOYSA-N
- CAS Registry Number: 120-21-8
- Chemical structure:
View 3d structure (requires JavaScript / HTML 5) - Other names: Benzaldehyde, p-(diethylamino)-; p-(Diethylamino)benzaldehyde; p-Formyl-N,N-diethylaniline; 4-(Diethylamino)benzaldehyde; 4-(N,N-Diethylamino)benzaldehyde

Phase change data

Data compiled by: Robert L. Brown and Stephen E. Stein
Quantity | Value | Units | Method | Reference | Comment |
---|---|---|---|---|---|
Tfus | 314. | K | N/A | Buckingham and Donaghy, 1982 |
Reduced pressure boiling point
Tboil (K) | Pressure (bar) | Reference |
---|---|---|
447.2 | 0.009 | Weast and Grasselli, 1989 |
447. | 0.009 | Buckingham and Donaghy, 1982 |

References

Buckingham and Donaghy, 1982
Buckingham, J.; Donaghy, S.M.,
Dictionary of Organic Compounds: Fifth Edition, Chapman and Hall, New York, 1982, 1. [all data]
Weast and Grasselli, 1989
CRC Handbook of Data on Organic Compounds, 2nd Editon, Weast,R.C and Grasselli, J.G., ed(s)., CRC Press, Inc., Boca Raton, FL, 1989, 1. [all data]