Ethanone, 1-(2,5-dimethoxyphenyl)-
- Formula: C10H12O3
- Molecular weight: 180.2005
- IUPAC Standard InChIKey: FAXUIYJKGGUCBO-UHFFFAOYSA-N
- CAS Registry Number: 1201-38-3
- Chemical structure:
View 3d structure (requires JavaScript / HTML 5) - Other names: Acetophenone, 2',5'-dimethoxy-; 2,5-Dimethoxyacetophenone; 2',5'-Dimethoxyacetophenone; 2-Acetyl-1,4-dimethoxybenzene; 2,5-Dihydroxyacetophenone, dimethyl ether; 1-(2,5-Dimethoxyphenyl)ethanone

Phase change data

Data compiled by: Robert L. Brown and Stephen E. Stein
Reduced pressure boiling point
Tboil (K) | Pressure (bar) | Reference |
---|---|---|
429.7 | 0.015 | Aldrich Chemical Company Inc., 1990 |

Van Den Dool and Kratz RI, non-polar column, custom temperature program

Column type | Active phase | I | Reference | Comment |
---|---|---|---|---|
Capillary | VF-5MS | 1514.6 | Tret'yakov, 2008 | 30. m/0.25 mm/0.25 μm, He; Program: Multi-step temperature program; T(initial)=60C; T(final)=270C |

References

Aldrich Chemical Company Inc., 1990
Aldrich Chemical Company Inc.,
Catalog Handbook of Fine Chemicals, Aldrich Chemical Company, Inc., Milwaukee WI, 1990, 1. [all data]
Tret'yakov, 2008
Tret'yakov, K.V.,
Retention Data. NIST Mass Spectrometry Data Center., NIST Mass Spectrometry Data Center, 2008. [all data]