Isoeugenol, benzyl ether
- Formula: C17H18O2
- Molecular weight: 254.3236
- IUPAC Standard InChIKey: YKSSSKBJDZDZTD-XVNBXDOJSA-N
- CAS Registry Number: 120-11-6
- Chemical structure:
View 3d structure (requires JavaScript / HTML 5) - Other names: Benzene, 2-methoxy-1-(phenylmethoxy)-4-(1-propenyl)-; Benzene, 1-(benzyloxy)-2-methoxy-4-propenyl-; Benzyl alcohol, ether with isoeugenol; Benzyl isoeugenol; Benzyl isoeugenol ether; Benzyl 2-methoxy-4-propenylphenyl ether; 1-(Benzyloxy)-2-methoxy-4-(1-propenyl)benzene; Benzene, 2-methoxy-1-(phenylmethoxy)-4-(1-propen-1-yl)-; NSC 46157; benzyl 2-methoxy-4-prop-1-enylphenyl ether

Kovats' RI, non-polar column, isothermal

Column type | Active phase | Temperature (C) | I | Reference | Comment |
---|---|---|---|---|---|
Capillary | SE-30 | 100. | 2078.4 | Tudor, 1997 | 40. m/0.35 mm/0.35 μm |

References

Tudor, 1997
Tudor, E.,
Temperature dependence of the retention index for perfumery compounds on a SE-30 glass capillary column. I. Linear equations,
J. Chromatogr. A, 1997, 779, 1-2, 287-297, https://doi.org/10.1016/S0021-9673(97)00453-6
. [all data]