1,4,4a,8a-Tetrahydro-1,4-methanonaphthalene-5,8-dione
- Formula: C11H10O2
- Molecular weight: 174.1959
- IUPAC Standard InChIKey: FQLRTGXTYFCECH-UHFFFAOYSA-N
- CAS Registry Number: 1200-89-1
- Chemical structure:
View 3d structure (requires JavaScript / HTML 5) - Other names: 1,4,4-α,8-α-Tetrahydro-endo-1,4-methanonaphthalene-5,8-dione; Cyclopentadienebenzoquinone; 1,4-Methanonaphthalene-5,8-dione, 1,4,4a,8a-tetrahydro-; 1,4,4-alpha,8-alpha-Tetrahydro-endo-1,4-methanonaphthalene-5,8-dione

Condensed phase thermochemistry data

Data compiled by: Hussein Y. Afeefy, Joel F. Liebman, and Stephen E. Stein
Quantity | Value | Units | Method | Reference | Comment |
---|---|---|---|---|---|
ΔfH°solid | -150.9 | kJ/mol | Ccb | Cookson, Crundwell, et al., 1964 | |
Quantity | Value | Units | Method | Reference | Comment |
ΔcH°solid | -5606.89 | kJ/mol | Ccb | Cookson, Crundwell, et al., 1964 | Corresponding ΔfHºsolid = -150.9 kJ/mol (simple calculation by NIST; no Washburn corrections) |
ΔcH°solid | -5593.6 ± 5.4 | kJ/mol | Ccb | Wassermann, 1935 | Reanalyzed by Cox and Pilcher, 1970, Original value = -5590. ± 4. kJ/mol; Corresponding ΔfHºsolid = -164.2 kJ/mol (simple calculation by NIST; no Washburn corrections) |

References

Cookson, Crundwell, et al., 1964
Cookson, R.C.; Crundwell, E.; Hill, R.R.; Hudec, J.,
586. Photochemical cyclisation of Diels-Alder adducts.,
J. Chem. Soc., 1964, 3062-3075. [all data]
Wassermann, 1935
Wassermann, A.,
The mechanism of additions to double bonds. Part I. Thermochemistry and kinetics of a diene synthesis,
J. Chem. Soc., 1935, 828-838. [all data]
Cox and Pilcher, 1970
Cox, J.D.; Pilcher, G.,
Thermochemistry of Organic and Organometallic Compounds, Academic Press, New York, 1970, 1-636. [all data]