Al2H6 radical
- Formula: Al2H6
- Molecular weight: 60.01072
- CAS Registry Number: 12004-30-7

Reaction thermochemistry data

Data compiled by: John E. Bartmess
Individual Reactions
+ H6Al2 = H7Al2-
By formula: H- + H6Al2 = H7Al2-
Quantity | Value | Units | Method | Reference | Comment |
---|---|---|---|---|---|
ΔrH° | 77.0 ± 4.0 | kcal/mol | CIDT | Goebbert, Hernandez, et al., 2005 | gas phase |

References

Goebbert, Hernandez, et al., 2005
Goebbert, D.J.; Hernandez, H.; Francisco, J.S.; Wenthold, P.G.,
The binding energy and bonding in dialane,
J. Am. Chem. Soc., 2005, 127, 33, 11684-11689, https://doi.org/10.1021/ja0424070
. [all data]