2,2'-Biquinoline
- Formula: C18H12N2
- Molecular weight: 256.3013
- IUPAC Standard InChIKey: WPTCSQBWLUUYDV-UHFFFAOYSA-N
- CAS Registry Number: 119-91-5
- Chemical structure:
View 3d structure (requires JavaScript / HTML 5) - Other names: Cuproin; Cuproine; 2,2'-Biquinolyl; 2,2'-Diquinolyl; 2,2'-Quinolyl

Gas phase thermochemistry data

Data compiled as indicated in comments:
ALS - Hussein Y. Afeefy, Joel F. Liebman, and Stephen E. Stein
Quantity | Value | Units | Method | Reference | Comment |
---|---|---|---|---|---|
ΔfH°gas | 425.9 | kJ/mol | Semi | Stewart, 2004 | |
ΔfH°gas | 347.9 ± 7.9 | kJ/mol | Ccb | Faour and Akasheh, 1985 | ALS |

Condensed phase thermochemistry data

Data compiled by: Hussein Y. Afeefy, Joel F. Liebman, and Stephen E. Stein
Quantity | Value | Units | Method | Reference | Comment |
---|---|---|---|---|---|
ΔfH°solid | 251.3 ± 7.0 | kJ/mol | Ccb | Faour and Akasheh, 1985 | |
Quantity | Value | Units | Method | Reference | Comment |
ΔcH°solid | -9049.4 ± 6.8 | kJ/mol | Ccb | Faour and Akasheh, 1985 |

Phase change data

Data compiled as indicated in comments:
AC - William E. Acree, Jr., James S. Chickos
DRB - Donald R. Burgess, Jr.
Quantity | Value | Units | Method | Reference | Comment |
---|---|---|---|---|---|
ΔsubH° | 134.7 ± 1.3 | kJ/mol | N/A | Ribeiro da Silva, 1997 | AC |
ΔsubH° | 96.6 | kJ/mol | N/A | Faour and Akasheh, 1985 | DRB |
Enthalpy of sublimation
ΔsubH (kJ/mol) | Temperature (K) | Method | Reference | Comment |
---|---|---|---|---|
129.5 ± 0.8 | 402. | ME | Ribeiro da Silva, 1997 | Based on data from 393. to 411. K.; AC |

Lee's RI, non-polar column, temperature ramp

Column type | Active phase | I | Reference | Comment |
---|---|---|---|---|
Capillary | SE-52 | 422.56 | Vassilaros, Kong, et al., 1982 | 20. m/0.30 mm/0.25 μm, H2, 40. C @ 2. min, 4. K/min; Tend: 265. C |
Capillary | SE-52 | 421.12 | Lee, Vassilaros, et al., 1979 | 12. m/0.3 mm/0.34 μm, He, 2. K/min; Tstart: 50. C; Tend: 250. C |

References

Stewart, 2004
Stewart, J.J.P.,
Comparison of the accuracy of semiempirical and some DFT methods for predicting heats of formation,
J. Mol. Model, 2004, 10, 1, 6-10, https://doi.org/10.1007/s00894-003-0157-6
. [all data]
Faour and Akasheh, 1985
Faour, M.; Akasheh, T.S.,
Heat of combustion of some N-heterocycle compounds. Part 1,
J. Chem. Soc. Perkin Trans. 2, 1985, 811-713. [all data]
Ribeiro da Silva, 1997
Ribeiro da Silva, M.,
Enthalpies of combustion, vapour pressures, and enthalpies of sublimation of 2-phenylquinoline and 2,2´-biquinoline,
The Journal of Chemical Thermodynamics, 1997, 29, 10, 1129-1136, https://doi.org/10.1006/jcht.1997.0229
. [all data]
Vassilaros, Kong, et al., 1982
Vassilaros, D.L.; Kong, R.C.; Later, D.W.; Lee, M.L.,
Linear retention index system for polycyclic aromatic compounds. Critical evaluation and additional indices,
J. Chromatogr., 1982, 252, 1-20, https://doi.org/10.1016/S0021-9673(01)88394-1
. [all data]
Lee, Vassilaros, et al., 1979
Lee, M.L.; Vassilaros, D.L.; White, C.M.; Novotny, M.,
Retention Indices for Programmed-Temperature Capillary-Column Gas Chromatography of Polycyclic Aromatic Hydrocarbons,
Anal. Chem., 1979, 51, 6, 768-773, https://doi.org/10.1021/ac50042a043
. [all data]