Benzenamine, 2-nitro-N-phenyl-
- Formula: C12H10N2O2
- Molecular weight: 214.2200
- IUPAC Standard InChIKey: RUKISNQKOIKZGT-UHFFFAOYSA-N
- CAS Registry Number: 119-75-5
- Chemical structure:
View 3d structure (requires JavaScript / HTML 5) - Other names: Diphenylamine, 2-nitro-; o-Nitro-N-phenylaniline; o-Nitrodiphenylamine; C.I. 10335; N-Phenyl-o-Nitroaniline; Sudan Yellow 1339; 2-Nitrodiphenylamine; o-(Phenylamino)nitrobenzene; 2-Nitro-N-phenylaniline; N-Phenyl-2-nitrobenzenamine; NSC 105613

Condensed phase thermochemistry data

Data compiled by: Hussein Y. Afeefy, Joel F. Liebman, and Stephen E. Stein
Quantity | Value | Units | Method | Reference | Comment |
---|---|---|---|---|---|
ΔfH°solid | 77. ± 2. | kJ/mol | Ccb | Contineanu and Marchidan, 1992 | |
ΔfH°solid | 64.5 ± 6.3 | kJ/mol | Ccb | Tavernier and Lamouroux, 1957 | Reanalyzed by Cox and Pilcher, 1970, Original value = 77.07 kJ/mol; Author's hf298_condensed=12.65 kcal/mol |
Quantity | Value | Units | Method | Reference | Comment |
ΔcH°solid | -6228. ± 2. | kJ/mol | Ccb | Contineanu and Marchidan, 1992 | |
ΔcH°solid | -6215.8 ± 6.3 | kJ/mol | Ccb | Tavernier and Lamouroux, 1957 | Reanalyzed by Cox and Pilcher, 1970, Original value = -6228.39 kJ/mol; Author's hf298_condensed=12.65 kcal/mol |

Phase change data

Data compiled as indicated in comments:
TRC - Thermodynamics Research Center, NIST Boulder Laboratories, Chris Muzny director
AC - William E. Acree, Jr., James S. Chickos
Quantity | Value | Units | Method | Reference | Comment |
---|---|---|---|---|---|
Tfus | 347.9 | K | N/A | Witschonke, 1954 | Metastable crystal phase; Uncertainty assigned by TRC = 0.3 K; TRC |
Tfus | 348.1 | K | N/A | Witschonke, 1954 | Crystal phase 1 phase; Uncertainty assigned by TRC = 0.2 K; TRC |
Tfus | 348.1 | K | N/A | Witschonke, 1954 | Crystal phase 1 phase; Uncertainty assigned by TRC = 0.15 K; TRC |
Enthalpy of sublimation
ΔsubH (kJ/mol) | Temperature (K) | Method | Reference | Comment |
---|---|---|---|---|
100.9 | 340.5 | A | Stephenson and Malanowski, 1987 | Based on data from 335. to 346. K.; AC |

Reaction thermochemistry data

Data compiled by: John E. Bartmess
Individual Reactions
C12H9N2O2- + =
By formula: C12H9N2O2- + H+ = C12H10N2O2
Quantity | Value | Units | Method | Reference | Comment |
---|---|---|---|---|---|
ΔrG° | 1374. ± 8.4 | kJ/mol | IMRE | Koppel, Koppel, et al., 1998 | gas phase |

Gas phase ion energetics data

Data compiled by: John E. Bartmess
De-protonation reactions
C12H9N2O2- + =
By formula: C12H9N2O2- + H+ = C12H10N2O2
Quantity | Value | Units | Method | Reference | Comment |
---|---|---|---|---|---|
ΔrG° | 1374. ± 8.4 | kJ/mol | IMRE | Koppel, Koppel, et al., 1998 | gas phase |

Kovats' RI, non-polar column, temperature ramp

Column type | Active phase | I | Reference | Comment |
---|---|---|---|---|
Packed | OV-101 | 1886. | Alley and Dykes, 1972 | 6. K/min; Tstart: 70. C; Tend: 220. C |

Lee's RI, non-polar column, custom temperature program

Column type | Active phase | I | Reference | Comment |
---|---|---|---|---|
Capillary | OV-101 | 335.7 | Tucminen, Wickstrom, et al., 1986 | Program: not specified |

References

Contineanu and Marchidan, 1992
Contineanu, I.; Marchidan, D.I.,
The enthalpies of combustion and formation of 2-nitrodiphenylamine and 2,2', 4,4', 6,6'-hexanitrodibenzyl,
Rev. Roum. Chim., 1992, 37, 11-12. [all data]
Tavernier and Lamouroux, 1957
Tavernier, P.; Lamouroux, M.,
Determinations calorimetriques relatives a vingt et une substances organiques,
Mem. Poudres, 1957, 39, 335-356. [all data]
Cox and Pilcher, 1970
Cox, J.D.; Pilcher, G.,
Thermochemistry of Organic and Organometallic Compounds, Academic Press, New York, 1970, 1-636. [all data]
Witschonke, 1954
Witschonke, C.R.,
Freezing point and purity data for some organic compounds,
Anal. Chem., 1954, 26, 562-4. [all data]
Stephenson and Malanowski, 1987
Stephenson, Richard M.; Malanowski, Stanislaw,
Handbook of the Thermodynamics of Organic Compounds, 1987, https://doi.org/10.1007/978-94-009-3173-2
. [all data]
Koppel, Koppel, et al., 1998
Koppel, I.; Koppel, J.; Maria, P.C.; Gal, J.F.; Notario, R.; Vlasov, V.M.; Taft, R.W.,
Comparison of Bronsted acidities of neutral NH-acids in gas phase, dimethyl sulfoxide and water,
Int. J. Mass Spectrom., 1998, 175, 1-2, 61-69, https://doi.org/10.1016/S0168-1176(98)00113-X
. [all data]
Perkampus and Braunschweig, 1966
Perkampus, H.-H.; Braunschweig, T.H.,
UV atlas of organic compounds, 1966, 2, D11/20. [all data]
Alley and Dykes, 1972
Alley, B.J.; Dykes, H.W.H.,
Gas-Liquid Chromatographic Determination of Nitrate Esters,Stabilizers and Plasticizers in Nitrocellulose-Base Propellants,
J. Chromatogr., 1972, 71, 1, 23-37, https://doi.org/10.1016/S0021-9673(01)85687-9
. [all data]
Tucminen, Wickstrom, et al., 1986
Tucminen, A.; Wickstrom, K.; Pyysalo, H.,
Determination of Polycyclic Aromatic Compounds by GLC-Selected Ion Monitoring (SIM) Technique,
J. Hi. Res. Chromatogr. Chromatogr. Comm., 1986, 9, 8, 469-471, https://doi.org/10.1002/jhrc.1240090813
. [all data]