Benzene, (1-ethylpropyl)-
- Formula: C11H16
- Molecular weight: 148.2447
- IUPAC Standard InChIKey: PBWHJRFXUPLZDS-UHFFFAOYSA-N
- CAS Registry Number: 1196-58-3
- Chemical structure:
View 3d structure (requires JavaScript / HTML 5) - Other names: 3-Phenylpentane; (1-Ethylpropyl)benzene

Phase change data

Data compiled by: Thermodynamics Research Center, NIST Boulder Laboratories, Chris Muzny director
Quantity | Value | Units | Method | Reference | Comment |
---|---|---|---|---|---|
Tboil | 458. ± 9. | K | AVG | N/A | Average of 7 values; Individual data points |

Reaction thermochemistry data

Data compiled by: Hussein Y. Afeefy, Joel F. Liebman, and Stephen E. Stein
Individual Reactions
By formula: C11H16 = C11H16
Quantity | Value | Units | Method | Reference | Comment |
---|---|---|---|---|---|
ΔrH° | -0.16 ± 0.08 | kJ/mol | Eqk | Pimerzin, Nesterova, et al., 1985 | liquid phase; AlCl3 |
ΔrH° | -0.16 ± 0.08 | kJ/mol | Eqk | Nesterova, Pimerzin, et al., 1984 | liquid phase; At 341.9 K, see Pimerzin, Nesterova, et al., 1985, see Pimerzin, Nesterova, et al., 1986 |

Kovats' RI, non-polar column, isothermal

Column type | Active phase | Temperature (C) | I | Reference | Comment |
---|---|---|---|---|---|
Capillary | OV-101 | 100. | 1082. | Engewald, Topalova, et al., 1987 | Column length: 50. m; Column diameter: 0.30 mm |

Kovats' RI, non-polar column, temperature ramp

Column type | Active phase | I | Reference | Comment |
---|---|---|---|---|
Capillary | OV-101 | 1071. | Hayes and Pitzer, 1982 | 110. m/0.25 mm/0.20 μm, He, 1. K/min; Tstart: 35. C; Tend: 200. C |

Kovats' RI, polar column, isothermal

Column type | Active phase | Temperature (C) | I | Reference | Comment |
---|---|---|---|---|---|
Capillary | Carbowax 20M | 90. | 1280.7 | Döring, Estel, et al., 1974 | Column length: 100. m; Column diameter: 0.2 mm |

Van Den Dool and Kratz RI, non-polar column, temperature ramp

Column type | Active phase | I | Reference | Comment |
---|---|---|---|---|
Capillary | OV-101 | 1071. | Hayes and Pitzer, 1981 | 108. m/0.25 mm/0.2 μm, 1. K/min; Tstart: 35. C; Tend: 200. C |

Normal alkane RI, non-polar column, temperature ramp

Column type | Active phase | I | Reference | Comment |
---|---|---|---|---|
Capillary | DB-1 | 1076. | Zenkevich, Ukolov, et al., 2011 | 30. m/0.32 mm/0.25 μm, Nitrogen, 5. K/min; Tstart: 100. C; Tend: 200. C |

Normal alkane RI, non-polar column, custom temperature program

Column type | Active phase | I | Reference | Comment |
---|---|---|---|---|
Capillary | Polydimethyl siloxane | 1077. | Cowley, de Klerk, et al., 2006 | Program: not specified |
Capillary | Methyl Silicone | 1076. | Zenkevich and Marinichev, 2001 | Program: not specified |
Capillary | OV-1, SE-30, Methyl silicone, SP-2100, OV-101, DB-1, etc. | 1071. | Waggott and Davies, 1984 | Hydrogen; Column length: 50. m; Column diameter: 0.32 mm; Program: not specified |
Capillary | Methyl Silicone | 1090. | Bonchev, Mekenjan, et al., 1979 | Program: not specified |

Normal alkane RI, polar column, isothermal

Column type | Active phase | Temperature (C) | I | Reference | Comment |
---|---|---|---|---|---|
Capillary | Carbowax 20M | 90. | 1281. | Sutter, Peterson, et al., 1997 |

Normal alkane RI, polar column, temperature ramp

Column type | Active phase | I | Reference | Comment |
---|---|---|---|---|
Capillary | Carbowax 20M | 1268. | Herain, MRAVEC, et al., 1991 | 70. C @ 21. min, 5. K/min, 150. C @ 999. min |

References

Pimerzin, Nesterova, et al., 1985
Pimerzin, a.A.; Nesterova, T.N.; Rozhnov, A.M.,
Equilibria of isomeric transformations and relations between thermodynamic properties of secondary alkylbenzenes,
J. Chem. Thermodyn., 1985, 17, 641-648. [all data]
Nesterova, Pimerzin, et al., 1984
Nesterova, T.N.; Pimerzin, A.A.; Rozhnov, A.M.; Roshchupkina, I.Ya.,
Thermodynamics of aromatic hydrocarbons,
Probl. Kalorim. Khim. Termodin., Dokl. Vses. Konf., 10th, 1984, 1, 225-227. [all data]
Pimerzin, Nesterova, et al., 1986
Pimerzin, A.A.; Nesterova, T.N.; Rozhnov, A.M.,
Equilibria of isomeric transformations and relations between thermodynamic properties of secondary alkylbenzenes,
J. Chem. Thermodyn., 1986, 17, 641-648. [all data]
Engewald, Topalova, et al., 1987
Engewald, W.; Topalova, I.; Petsev, N.; Dimitrov, Chr.,
Structure-Retention Correlations of Hydrocarbons in GLC and GSC. Alkenylbenzenes,
Chromatographia, 1987, 23, 8, 561-565, https://doi.org/10.1007/BF02324864
. [all data]
Hayes and Pitzer, 1982
Hayes, P.C., Jr.; Pitzer, E.W.,
Characterizing petroleum- and shale-derived jet fuel distillates via temperature-programmed Kováts indices,
J. Chromatogr., 1982, 253, 179-198, https://doi.org/10.1016/S0021-9673(01)88376-X
. [all data]
Döring, Estel, et al., 1974
Döring, C.E.; Estel, D.; Fischer, R.,
Kapillar-gaschromatographische Charakterisierung von C10-bis C12-Aromaten,
J. Prakt. Chem., 1974, 316, 1, 1-12, https://doi.org/10.1002/prac.19743160102
. [all data]
Hayes and Pitzer, 1981
Hayes, P.C., Jr.; Pitzer, E.W.,
Kovats indices as a tool in characterizing hydrocarbon fuels in temperature programmed glass capillary gas chromatography. Part 1. Qualitative identification, Inhouse rpt. for Air Force Wright Aeronautical Labs., Air Force Wright Aeronautical Labs., Wright-Patterson AFB, Ohio, 1981, 75. [all data]
Zenkevich, Ukolov, et al., 2011
Zenkevich, I.G.; Ukolov, A.I.; Kushakova, A.S.; Gustyleva, L.K.,
Identification of isomeric alkylarenes with the use of additive relations for the evaluation of gas-chromatographic retention indices,
Rus. J. Anal. Chem., 2011, 66, 12, 1165-1172, https://doi.org/10.1134/S1061934811120136
. [all data]
Cowley, de Klerk, et al., 2006
Cowley, M.; de Klerk, A.; Nel, R.J.J.; Rademan, J.D.,
Supporting information: alkylation of benzene with 1-pentene over solid phosphoric acid,
Ind. Eng. Chem. Res., 2006, 45, 22, 7399-7408, https://doi.org/10.1021/ie060197p
. [all data]
Zenkevich and Marinichev, 2001
Zenkevich, I.G.; Marinichev, A.N.,
Comparison of Topological and Dynamics Molecular Characteristics for Precalculation of Chromatographic Retention Parameters of Organic Compounds (in Russian),
Zh. Struct. Khim., 2001, 42, 5, 893-902. [all data]
Waggott and Davies, 1984
Waggott, A.; Davies, I.W.,
Identification of organic pollutants using linear temperature programmed retention indices (LTPRIs) - Part II, 1984, retrieved from http://dwi.defra.gov.uk/research/completed-research/reports/dwi0383.pdf. [all data]
Bonchev, Mekenjan, et al., 1979
Bonchev, D.; Mekenjan, Ov.; Protic, G.; Trinajstic, N.,
Application of Topological Indices to Gas Chromatographic Data: Calculation of the Retention Indices of Isomeric Alkylbenzenes,
J. Chromatogr., 1979, 176, 2, 149-156, https://doi.org/10.1016/S0021-9673(00)85645-9
. [all data]
Sutter, Peterson, et al., 1997
Sutter, J.M.; Peterson, T.A.; Jurs, P.C.,
Prediction of gas chromatographic retention indices of alkylbenzenes,
Anal. Chim. Acta., 1997, 342, 2-3, 113-122, https://doi.org/10.1016/S0003-2670(96)00578-8
. [all data]
Herain, MRAVEC, et al., 1991
Herain, J.; MRAVEC, D.; SCHNIERER, A.,
identification of the components of the reaction mixtures from transalkylation of the waste fraction of diisopropylbenzenes by capillary GC and GC-MS,
Chem. Listy, 1991, 85, 5, 535-538. [all data]