Cyclohexanone, 5-methyl-2-(1-methylethyl)-, (2R-cis)-
- Formula: C10H18O
- Molecular weight: 154.2493
- IUPAC Standard InChIKey: NFLGAXVYCFJBMK-IUCAKERBSA-N
- CAS Registry Number: 1196-31-2
- Chemical structure:
View 3d structure (requires JavaScript / HTML 5) - Stereoisomers:
- Other names: p-Menthan-3-one, (1R,4R)-(+)-; (+)-Isomenthone; D-isomenthone; D-menthone

Condensed phase thermochemistry data

Data compiled by: Hussein Y. Afeefy, Joel F. Liebman, and Stephen E. Stein
Quantity | Value | Units | Method | Reference | Comment |
---|---|---|---|---|---|
ΔcH°liquid | -5350.1 | kJ/mol | Ccb | Tanaka, 1939 | Corresponding ΔfHºliquid = -1157. kJ/mol (simple calculation by NIST; no Washburn corrections) |

References

Tanaka, 1939
Tanaka, S.,
On the addition of oxygen to the double bonds,
Mem. Coll. Sci. Univ. Kyoto, Ser. A, 1939, 22, 97-126. [all data]