Methanone, dicyclohexyl-

Kovats' RI, polar column, isothermal

Data compiled by: NIST Mass Spectrometry Data Center, William E. Wallace, director

Column type PackedPackedPacked
Active phase Carbowax 20MCarbowax 20MCarbowax 20M
Column length (m) 2.2.2.
Carrier gas
Substrate
Column diameter (mm)
Phase thickness (μm)
Temperature (C) 120.140.160.
I 1883.1920.1957.
ReferencePascal, Heintz, et al., 1974Pascal, Heintz, et al., 1974Pascal, Heintz, et al., 1974
Comment MSDC-RI MSDC-RI MSDC-RI

References

Pascal, Heintz, et al., 1974
Pascal, J.C.; Heintz, M.; Druilhe, A.; Lefort, D., Relations entre structure chimique et grandeurs de rétention. III. Stéréoisomères cyclohexaniques, Chromatographia, 1974, 7, 5, 236-245, https://doi.org/10.1007/BF02321774 . [all data]