Benzoin
- Formula: C14H12O2
- Molecular weight: 212.2439
- IUPAC Standard InChIKey: ISAOCJYIOMOJEB-UHFFFAOYSA-N
- CAS Registry Number: 119-53-9
- Chemical structure:
View 3d structure (requires JavaScript / HTML 5) - Other names: Ethanone, 2-hydroxy-1,2-diphenyl-; α-Hydroxy-α-phenylacetophenone; Benzoylphenylcarbinol; Bitter almond oil camphor; 2-Hydroxy-2-phenylacetophenone; Acetophenone, 2-hydroxy-2-phenyl-; Ketone, α-hydroxybenzyl phenyl; NCI-C50011; Phenyl-α-hydroxybenzyl ketone; 2-Hydroxy-1,2-diphenylethanone; Fenyl-α-hydroxybenzylketon; α-Hydroxybenzyl phenyl ketone; Wy 42956; 2-Hydroxy-1,2-diphenylethan-1-one; (.+/-.)-Benzoin; NSC 8082

Condensed phase thermochemistry data

Data compiled by: Hussein Y. Afeefy, Joel F. Liebman, and Stephen E. Stein
Quantity | Value | Units | Method | Reference | Comment |
---|---|---|---|---|---|
ΔfH°solid | -247.9 | kJ/mol | Ccb | Parks and Mosher, 1962 | |
Quantity | Value | Units | Method | Reference | Comment |
ΔcH°solid | -6976. ± 3. | kJ/mol | Ccb | Parks and Mosher, 1962 | Corresponding ΔfHºsolid = -247.8 kJ/mol (simple calculation by NIST; no Washburn corrections) |

Phase change data

Data compiled as indicated in comments:
BS - Robert L. Brown and Stephen E. Stein
TRC - Thermodynamics Research Center, NIST Boulder Laboratories, Chris Muzny director
Quantity | Value | Units | Method | Reference | Comment |
---|---|---|---|---|---|
Tfus | 406. to 407. | K | N/A | Buckingham and Donaghy, 1982 | BS |
Tfus | 408. | K | N/A | Pearl and Dehn, 1938 | Uncertainty assigned by TRC = 2. K; TRC |
Tfus | 406. | K | N/A | Roger and McGregor, 1934 | Uncertainty assigned by TRC = 3. K; TRC |
Tfus | 407. | K | N/A | Buck and Jenkins, 1929 | Uncertainty assigned by TRC = 3. K; TRC |
Reduced pressure boiling point
Tboil (K) | Pressure (bar) | Reference | Comment |
---|---|---|---|
617. | 1.02 | Buckingham and Donaghy, 1982 | BS |
467. | 0.016 | Buckingham and Donaghy, 1982 | BS |
Antoine Equation Parameters
log10(P) = A − (B / (T + C))
P = vapor pressure (bar)
T = temperature (K)
View plot Requires a JavaScript / HTML 5 canvas capable browser.
Temperature (K) | A | B | C | Reference | Comment |
---|---|---|---|---|---|
408.8 to 616. | 5.09337 | 2924.452 | -41.548 | Stull, 1947 | Coefficents calculated by NIST from author's data. |

References

Parks and Mosher, 1962
Parks, G.S.; Mosher, H.P.,
Heats of combustion and formation of seven organic compounds containing oxygen,
J. Chem. Phys., 1962, 37, 919-920. [all data]
Buckingham and Donaghy, 1982
Buckingham, J.; Donaghy, S.M.,
Dictionary of Organic Compounds: Fifth Edition, Chapman and Hall, New York, 1982, 1. [all data]
Pearl and Dehn, 1938
Pearl, I.A.; Dehn, W.M.,
Reduction fo Benzil,
J. Am. Chem. Soc., 1938, 60, 57. [all data]
Roger and McGregor, 1934
Roger, R.; McGregor, A.,
The Action of Grignard reagent on Desyl Chloride. Part I. Aryl Grignard Reagent,
J. Chem. Soc., 1934, 1934, 1850-3. [all data]
Buck and Jenkins, 1929
Buck, J.S.; Jenkins, S.S.,
Catalytic Reduction of Alpha-Diketones and Their Derivatives,
J. Am. Chem. Soc., 1929, 51, 2163. [all data]
Stull, 1947
Stull, Daniel R.,
Vapor Pressure of Pure Substances. Organic and Inorganic Compounds,
Ind. Eng. Chem., 1947, 39, 4, 517-540, https://doi.org/10.1021/ie50448a022
. [all data]