Benzene, 1-methyl-4-(1-methylethenyl)-
- Formula: C10H12
- Molecular weight: 132.2023
- IUPAC Standard InChIKey: MMSLOZQEMPDGPI-UHFFFAOYSA-N
- CAS Registry Number: 1195-32-0
- Chemical structure:
View 3d structure (requires JavaScript / HTML 5) - Other names: p-Cymenene; Styrene, p,α-dimethyl-; α,p-Dimethylstyrene; α,4-Dimethylstyrene; p-Isopropenyl toluene; p-Methyl-α-methylstyrene; p,α-Dimethylstyrene; Dehydro-p-cymene; 1-Methyl-4-isopropenylbenzene; 2-(p-Methylphenyl)propene; 2-p-Tolylpropene; 4-Isopropenyltoluene; 4-Methyl-α-methylstyrene; 1-Methyl-4-(1-methylethenyl)-benzene; 1-methyl-4α-methylstyrene; Methyl-4-(1-methylethenyl)-benzene; para- α-Dimethylstyrene; 4-CH3C6H4C(CH3)CH2; 1-p-Tolyl-1-methylethylene; 4-Methylisopropenylbenzene; NSC 361058; 1-Isopropenyl-4-methylbenzene; Cymenene; α-dimethyl-p-styrene; p,α-Dimethylstyrol; Styrene, α,4-dimethyl; Dimethyl-p-styrene

Gas phase ion energetics data

Data evaluated by: Edward P. Hunter and Sharon G. Lias
Quantity | Value | Units | Method | Reference | Comment |
---|---|---|---|---|---|
Proton affinity (review) | 881.8 | kJ/mol | N/A | Hunter and Lias, 1998 | |
Quantity | Value | Units | Method | Reference | Comment |
Gas basicity | 852.9 | kJ/mol | N/A | Hunter and Lias, 1998 |

Normal alkane RI, non-polar column, temperature ramp

Data compiled by: NIST Mass Spectrometry Data Center, William E. Wallace, director

Column type CapillaryCapillaryCapillaryCapillaryCapillary
Active phase VF-5 MSVF-5 MSDB-15 % Phenyl methyl siloxaneZB-1
Column length (m) 60.60.60.60.30.
Carrier gas HeliumHeliumNitrogenHeliumNitrogen
Substrate
Column diameter (mm) 0.320.320.250.250.25
Phase thickness (μm) 0.250.250.250.250.25
Tstart (C) 30.30.60.90.45.
Tend (C) 260.260.250.225.230.
Heat rate (K/min) 2.2.5.3.3.
Initial hold (min)
Final hold (min) 28.28. 3.
I 1091.1092.1073.1092.1066.
ReferenceLeffingwell and Alford, 2011Leffingwell and Alford, 2011Meshkatalsadat, Safaei-Ghomi. J., et al., 2010Retta, Gattuso, et al., 2009Mierendorff, Stahl-Biskup, et al., 2008
Comment MSDC-RI MSDC-RI MSDC-RI MSDC-RI MSDC-RI
Column type CapillaryCapillaryCapillaryCapillaryCapillary
Active phase SPB-1HP-5MSCP Sil 5 CBBP-1SPB-1
Column length (m) 30.30.25.50.30.
Carrier gas HeHeHeHeHelium
Substrate
Column diameter (mm) 0.20.25 0.220.20
Phase thickness (μm) 0.20.25 0.250.20
Tstart (C) 70.60.80.60.70.
Tend (C) 220.280.270.220.220.
Heat rate (K/min) 3.3.10.2.3.
Initial hold (min)
Final hold (min) 15.  20.15.
I 1070.1058.1075.1069.1071.
ReferencePinto, Salgueiro, et al., 2007Tzakou, Bazos, et al., 2007Ayoub, Al-Azizi, et al., 2006Boti, Muselli, et al., 2006Cavaleiro, Pinto, et al., 2006
Comment MSDC-RI MSDC-RI MSDC-RI MSDC-RI MSDC-RI
Column type CapillaryCapillaryCapillaryCapillaryCapillary
Active phase BP-1HP-5DB-5DB-5DB-5
Column length (m) 50.30.30.30.30.
Carrier gas HeHeHeHeHe
Substrate
Column diameter (mm) 0.220.250.250.250.25
Phase thickness (μm) 0.250.250.250.250.25
Tstart (C) 60.50.60.60.50.
Tend (C) 220.300.240.240.250.
Heat rate (K/min) 2.5.5.5.3.
Initial hold (min)  5.2.2.
Final hold (min) 20.5.  10.
I 1072.1091.1064.1064.1090.
ReferenceFanciullino, Tomi, et al., 2006Figuérédo, Cabassu, et al., 2006Gohari, Hadjiakhoondi, et al., 2006Gohari A.R., Hadjiakhoondi A., et al., 2006Havlik, Kokoska, et al., 2006
Comment MSDC-RI MSDC-RI MSDC-RI MSDC-RI MSDC-RI
Column type CapillaryCapillaryCapillaryCapillaryCapillary
Active phase DB-5HP-5 MSHP-5DB-1DB-5
Column length (m) 30.30.30.50.30.
Carrier gas HeliumNitrogenN2N2Hydrogen
Substrate
Column diameter (mm) 0.250.250.250.250.25
Phase thickness (μm) 0.250.250.520.250.25
Tstart (C) 60.50.50.95.70.
Tend (C) 260.280.280.240.280.
Heat rate (K/min) 3.5.5.4.4.
Initial hold (min)     4.
Final hold (min)  5.5.
I 1081.1071.1071.1084.1088.
ReferenceJavidnia, Miri, et al., 2006Marzouk, Mansour, et al., 2006Marzouk, Neffati, et al., 2006Pala-Paul J., Perez-Alonso M.J., et al., 2006Pino, Marbot, et al., 2006
Comment MSDC-RI MSDC-RI MSDC-RI MSDC-RI MSDC-RI
Column type CapillaryCapillaryCapillaryCapillaryCapillary
Active phase DB-5HP-5MSMethyl SiliconeHP-1HP-1
Column length (m) 30.30.25.50.50.
Carrier gas HydrogenHeN2He
Substrate
Column diameter (mm) 0.250.250.30.20.2
Phase thickness (μm) 0.250.250.150.50.25
Tstart (C) 70.60.50.60.60.
Tend (C) 280.280.210.250.250.
Heat rate (K/min) 4.3.2.2.2.
Initial hold (min) 4. 5. 60.
Final hold (min)    60.
I 1088.1056.1097.1074.1071.
ReferencePino, Marbot, et al., 2006Pitarokili, Tzakou, et al., 2006Tonzibo, Coffy, et al., 2006Bendimerad and Bendiab, 2005Fernandez, Lizzani-Cuvelier, et al., 2005
Comment MSDC-RI MSDC-RI MSDC-RI MSDC-RI MSDC-RI
Column type CapillaryCapillaryCapillaryCapillaryCapillary
Active phase HP-5DB-1CP Sil 5 CBHP-5MSDB-5
Column length (m) 30.30.25.30.30.
Carrier gas HeHe HeHe
Substrate
Column diameter (mm) 0.250.250.250.250.25
Phase thickness (μm) 0.250.250.150.250.25
Tstart (C) 50.50.50.60.60.
Tend (C) 300.265.230.275.230.
Heat rate (K/min) 5.2.53.4.3.
Initial hold (min) 5.1.
Final hold (min) 5.30.  20.
I 1091.1066.1077.1090.1091.
ReferenceFiguérédo, Cabassu, et al., 2005Khalighi-Sigaroodi, Hadijiakhoondi, et al., 2005Ogunwande, Olawore, et al., 2005Sajjadi and Ghannadi, 2005Skoula and Grayer, 2005
Comment MSDC-RI MSDC-RI MSDC-RI MSDC-RI MSDC-RI
Column type CapillaryCapillaryCapillaryCapillaryCapillary
Active phase SPB-1BP-1SE-52DB-5MSDB-1
Column length (m) 50.50.25.30.60.
Carrier gas He N2HeN2
Substrate
Column diameter (mm) 0.20.220.320.250.25
Phase thickness (μm) 0.330.250.150.250.25
Tstart (C) 50.60.45.60.80.
Tend (C) 220.220.200.280.210.
Heat rate (K/min) 4.2.3.3.3.
Initial hold (min) 3. 5.
Final hold (min) 30.20.30.30.15.
I 1072.1071.1083.1060.1077.
ReferenceWong, Lee, et al., 2005Blanc, Muselli, et al., 2004Cakir, Kordali, et al., 2004Marongiu, Piras, et al., 2004Ueno, Masuda, et al., 2004
Comment MSDC-RI MSDC-RI MSDC-RI MSDC-RI MSDC-RI
Column type CapillaryCapillaryCapillaryCapillaryCapillary
Active phase RSL-200CP Sil 5 CBDB-5ZB-1OV-101
Column length (m) 30.25.50.30.50.
Carrier gas H2HeHeN2He
Substrate
Column diameter (mm) 0.320.250.20.250.2
Phase thickness (μm) 0.250.250.250.250.5
Tstart (C) 40.35.50.45.50.
Tend (C) 280.280.220.230.250.
Heat rate (K/min) 6.5.3.3.2.
Initial hold (min) 5.2.52.
Final hold (min) 5.
I 1082.1071.1088.1066.1074.
ReferenceJirovetz, Buchbauer, et al., 2003Kanjilal, Kotoky, et al., 2003Masotti, Juteau, et al., 2003Mierendorff, Stahl-Biskup, et al., 2003Orav, Kailas, et al., 2003
Comment MSDC-RI MSDC-RI MSDC-RI MSDC-RI MSDC-RI
Column type CapillaryCapillaryCapillaryCapillaryCapillary
Active phase OV-101DB-1DB-5DB-5DB-5
Column length (m) 50.50.30.30.25.
Carrier gas HeN2H2HeN2
Substrate
Column diameter (mm) 0.20.250.250.250.25
Phase thickness (μm) 0.50.250.250.250.25
Tstart (C) 50.95.60.60.50.
Tend (C) 250.240.280.240.250.
Heat rate (K/min) 2.4.4.3.4.
Initial hold (min)   10.
Final hold (min)   40. 10.
I 1070.1078.1090.1088.1091.
ReferenceOrav, Kailas, et al., 2003Perez-Alonso, Velasco-Negueruela, et al., 2003Pino, Marbot, et al., 2003Zoghbi, Andrade, et al., 2003Zrira, Elamrani, et al., 2003
Comment MSDC-RI MSDC-RI MSDC-RI MSDC-RI MSDC-RI
Column type CapillaryCapillaryCapillaryCapillaryCapillary
Active phase DB-5DB-5OV-101HP-5DB-5MS
Column length (m) 30.30.50.30.30.
Carrier gas HeHeHeN2He
Substrate
Column diameter (mm) 0.250.250.20.250.25
Phase thickness (μm) 0.250.250.50.250.25
Tstart (C) 60.60.50.60.60.
Tend (C) 240.240.250.220.240.
Heat rate (K/min) 3.3.2.5.3.
Initial hold (min)    10.
Final hold (min)
I 1091.1089.1072.1091.1079.
ReferenceFlamini, Ertugrul, et al., 2002Maia, da Silva, et al., 2002Orav, Kailas, et al., 2002Campeol, Flamini, et al., 2001Cherchi, Deidda, et al., 2001
Comment MSDC-RI MSDC-RI MSDC-RI MSDC-RI MSDC-RI
Column type CapillaryCapillaryCapillaryCapillaryCapillary
Active phase HP-5RTX-1BP-1OV-101OV-101
Column length (m) 30.30.50.50.25.
Carrier gas N2N2HeN2N2
Substrate
Column diameter (mm) 0.250.250.220.250.20
Phase thickness (μm) 0.250.250.25
Tstart (C) 60.60.60.80.60.
Tend (C) 220.300.230.200.240.
Heat rate (K/min) 5.4.2.2.4.
Initial hold (min) 10.
Final hold (min)   35.
I 1091.1078.1072.1076.1076.
ReferenceGallori, Flamini, et al., 2001Kalemba, Marschall, et al., 2001Lota, de Rocca Serra, et al., 2001Yang, 2001Zenkevich, 2001
Comment MSDC-RI MSDC-RI MSDC-RI MSDC-RI MSDC-RI
Column type CapillaryCapillaryCapillaryCapillaryCapillary
Active phase DB-5DB-1OV-101SE-30SE-30
Column length (m) 30.25.50.25.25.
Carrier gas HeNitrogenNitrogenHeHe
Substrate
Column diameter (mm) 0.250.500.250.20.2
Phase thickness (μm) 0.250.25
Tstart (C) 60.60.40.60.60.
Tend (C) 240.220.200.230.230.
Heat rate (K/min) 3.5.2.3.3.
Initial hold (min)   10. 10.
Final hold (min)
I 1089.1075.1072.1079.1079.
ReferenceMaia, Zoghbi, et al., 2000Mallavarapu, Rao, et al., 2000Tamura, Boonbumrung, et al., 2000Ali N.A.M. and Jantan, 1999Mohd and Jantan, 1999
Comment MSDC-RI MSDC-RI MSDC-RI MSDC-RI MSDC-RI
Column type CapillaryCapillaryCapillaryCapillaryCapillary
Active phase DB-5OV-101SPB-5DB-1HP-5
Column length (m) 30.25.50.
Carrier gas HeHeHe
Substrate
Column diameter (mm) 0.250.200.32
Phase thickness (μm) 0.25 0.25
Tstart (C) 40.80.60.80.40.
Tend (C) 250.240.240.220.210.
Heat rate (K/min) 2.6.3.6.2.
Initial hold (min) 5.
Final hold (min) 60. 20.
I 1071.1074.1090.1059.1097.
ReferencePorta, Porcedda, et al., 1999Zenkevich, Kosman, et al., 1999Doneanu and Anitescu, 1998Salgueiro, Vila, et al., 1997Collin, Deslauriers, et al., 1993
Comment MSDC-RI MSDC-RI MSDC-RI MSDC-RI MSDC-RI
Column type CapillaryCapillaryCapillaryCapillaryCapillary
Active phase CP Sil 5 CBSE-54OV-101OV-101BP-1
Column length (m) 25.30.50.50.50.
Carrier gas  HydrogenN2N2H2
Substrate
Column diameter (mm) 0.250.250.250.250.30
Phase thickness (μm)  0.25
Tstart (C) 60.60.80.80.40.
Tend (C) 280.250.200.200.250.
Heat rate (K/min) 5.2.2.2.10.
Initial hold (min)  5.  1.
Final hold (min)  2.
I 1078.1088.1078.1080.1075.
ReferenceKaul, Singh, et al., 1993Kollmannsberger, Nitz, et al., 1992Yang and Sugisawa, 1990Yang and Sugisawa, 1990Brophy, Davies, et al., 1989
Comment MSDC-RI MSDC-RI MSDC-RI MSDC-RI MSDC-RI
Column type CapillaryCapillaryCapillaryCapillary
Active phase OV-101OV-101SE-30SF-96
Column length (m) 50.50.100.111.
Carrier gas N2N2N2Nitrogen
Substrate
Column diameter (mm) 0.250.250.250.76
Phase thickness (μm)
Tstart (C) 80.80.45.
Tend (C) 200.200.250.130.
Heat rate (K/min) 2.2.4.3.
Initial hold (min)   1.8.
Final hold (min)    40.
I 1072.1080.1080.1076.
ReferenceSugisawa, Yang, et al., 1989Sugisawa, Yang, et al., 1989Peacock and Kuneman, 1985Donetzhuber, Johansson, et al., 1976
Comment MSDC-RI MSDC-RI MSDC-RI MSDC-RI

Van Den Dool and Kratz RI, non-polar column, temperature ramp

Data compiled by: NIST Mass Spectrometry Data Center, William E. Wallace, director

Column type CapillaryCapillaryCapillaryCapillaryCapillary
Active phase HP-5MSCP-Sil PONA GBBP-1BP-1RTX-1
Column length (m) 30.100.50.50.60.
Carrier gas HeHeHeHeHe
Substrate
Column diameter (mm) 0.250.250.220.220.22
Phase thickness (μm) 0.250.250.250.250.25
Tstart (C) 60.140.60.60.60.
Tend (C) 250.230.220.220.230.
Heat rate (K/min) 2.5.2.2.2.
Initial hold (min) 8.10.
Final hold (min) 30.25.20.20.30.
I 1092.1081.1070.1073.1072.
ReferenceBenkaci-Ali, Baaliouamer, et al., 2007Cunicao, Lopes, et al., 2007Duquesnoy, Castola, et al., 2007Lesueur, de Rocca Serra, et al., 2007Muselli, Rossi, et al., 2007
Comment MSDC-RI MSDC-RI MSDC-RI MSDC-RI MSDC-RI
Column type CapillaryCapillaryCapillaryCapillaryCapillary
Active phase HP-5MSHP-5MSBP-1BP-1DB-5
Column length (m) 30.30.50.50.30.
Carrier gas HeHe He
Substrate
Column diameter (mm) 0.250.250.220.220.25
Phase thickness (μm) 0.250.250.250.251.
Tstart (C) 60.80.60.60.50.
Tend (C) 280.300.220.220.290.
Heat rate (K/min) 4.4.2.2.10.
Initial hold (min) 5.   1.
Final hold (min)   20.20.10.
I 1087.1094.71072.1072.1095.
ReferenceSaroglou, Arfan, et al., 2007Zeng, Zhao, et al., 2007Blanc, Bradesi, et al., 2006Boti, Bighelli, et al., 2006Bylaite and Meyer, 2006
Comment MSDC-RI MSDC-RI MSDC-RI MSDC-RI MSDC-RI
Column type CapillaryCapillaryCapillaryCapillaryCapillary
Active phase Mega 5MSHP-5BP-1SPB-1DB-5
Column length (m) 60.30.50.30.30.
Carrier gas HeN2HeHeHe
Substrate
Column diameter (mm) 0.250.250.220.20.25
Phase thickness (μm) 0.250.250.250.20.25
Tstart (C) 60.60.60.70.50.
Tend (C) 240.220.220.220.250.
Heat rate (K/min) 3.5.2.3.5.
Initial hold (min)  10.  2.
Final hold (min)   20.15.
I 1078.1093.1072.1071.1091.
ReferenceCondurso, Verzera, et al., 2006Flamini, Tebano, et al., 2006Gonny, Cavaleiro, et al., 2006Pinto, Pina-Vaz, et al., 2006Su, Ho, et al., 2006
Comment MSDC-RI MSDC-RI MSDC-RI MSDC-RI MSDC-RI
Column type CapillaryCapillaryCapillaryCapillaryCapillary
Active phase DB-5BP-1RTX-1DB-1HP-5
Column length (m) 30.50.60.30.30.
Carrier gas HeHe HeN2
Substrate
Column diameter (mm) 0.250.220.220.250.25
Phase thickness (μm) 0.250.250.250.250.25
Tstart (C) 50.60.60.40.60.
Tend (C) 250.220.220.260.220.
Heat rate (K/min) 5.2.2.2.5.
Initial hold (min) 2.  5.10.
Final hold (min)  20.20.20.
I 1091.1072.1074.1080.1093.
ReferenceSu, Ho, et al., 2006, 2Boti J.B., Koukoua G., et al., 2005Cozzani, Muselli, et al., 2005de Feo, Urrunaga Soria, et al., 2005Flamini, Luigi Cioni, et al., 2005
Comment MSDC-RI MSDC-RI MSDC-RI MSDC-RI MSDC-RI
Column type CapillaryCapillaryCapillaryCapillaryCapillary
Active phase HP-5HP-5MSHP-5MSSE-54HP-5MS
Column length (m) 30.30.60.30.30.
Carrier gas HeHeHeHeHe
Substrate
Column diameter (mm) 0.250.250.20.250.25
Phase thickness (μm) 0.250.250.250.250.25
Tstart (C) 60.60.60.60.60.
Tend (C) 260.250.200.260.280.
Heat rate (K/min) 3.4.2.2.3.
Initial hold (min)  2. 5.
Final hold (min)  20.10.
I 1088.1089.1078.1087.1093.
ReferenceJavidnia, Miri, et al., 2005Pino, Mesa, et al., 2005Smadja, Rondeau, et al., 2005Alma, Nitz, et al., 2004Chorianopoulos, Kalpoutzakis, et al., 2004
Comment MSDC-RI MSDC-RI MSDC-RI MSDC-RI MSDC-RI
Column type CapillaryCapillaryCapillaryCapillaryCapillary
Active phase HP-5DB-5DB-5DB-5MSHP-5MS
Column length (m) 30.30.30.30.30.
Carrier gas HeN2N2HeHe
Substrate
Column diameter (mm) 0.250.250.250.250.25
Phase thickness (μm) 0.250.250.250.250.25
Tstart (C) 60.60.60.40.50.
Tend (C) 240.240.240.280.300.
Heat rate (K/min) 3.3.3.4.5.
Initial hold (min)    2.5.
Final hold (min)
I 1090.1091.1091.1089.1088.
ReferenceFlamini, Bader, et al., 2004Flamini, Cioni, et al., 2004Flamini, Cioni, et al., 2004Mardarowicz, Wianowska, et al., 2004Mumm, Tiemann, et al., 2004
Comment MSDC-RI MSDC-RI MSDC-RI MSDC-RI MSDC-RI
Column type CapillaryCapillaryCapillaryCapillaryCapillary
Active phase SPB-5HP-5MSDB-5DB-5DB-5
Column length (m) 30.30.25.30.30.
Carrier gas HeHeN2HeHe
Substrate
Column diameter (mm) 0.250.250.250.250.25
Phase thickness (μm) 0.250.250.250.250.25
Tstart (C) 60.50.75.60.60.
Tend (C) 250.200.210.240.240.
Heat rate (K/min) 4.6.3.3.3.
Initial hold (min) 2.1.510.
Final hold (min) 20.5.1.
I 1091.1094.1089.1091.1091.
ReferencePino, Marbot, et al., 2004Weissbecker, Holighaus, et al., 2004bin Ahmad and bin Jantan, 2003Bader, Flamini, et al., 2003Flamini, Luigi Cioni, et al., 2003
Comment MSDC-RI MSDC-RI MSDC-RI MSDC-RI MSDC-RI
Column type CapillaryCapillaryCapillaryCapillaryCapillary
Active phase HP-5HP-5HP-5MSHP-5RTX-5
Column length (m) 30.30.60.30.30.
Carrier gas N2 HeHeHe
Substrate
Column diameter (mm) 0.250.250.250.250.25
Phase thickness (μm) 0.25 0.250.250.25
Tstart (C) 60.25.40.60.45.
Tend (C) 220.150.310.240.250.
Heat rate (K/min) 5.3.3.3.3.
Initial hold (min) 10.5.1. 6.
Final hold (min)   20.
I 1091.1091.1091.1091.1091.
ReferenceFlamini, Luigi Cioni, et al., 2003, 2Isidorov, Vinogorova, et al., 2003Lalel, Singh, et al., 2003Macchioni, Cioni, et al., 2003Shellie, Marriott, et al., 2003
Comment MSDC-RI MSDC-RI MSDC-RI MSDC-RI MSDC-RI
Column type CapillaryCapillaryCapillaryCapillaryCapillary
Active phase SPB-1HP-5BP-1CP Sil 5 CBCP Sil 5 CB
Column length (m) 30.30.50.25.50.
Carrier gas HeN2HeN2He
Substrate
Column diameter (mm) 0.200.250.220.250.32
Phase thickness (μm) 0.200.250.250.250.4
Tstart (C) 70.60.60.60.60.
Tend (C) 220.220.220.280.280.
Heat rate (K/min) 3.5.2.4.3.
Initial hold (min)  10. 6.10.
Final hold (min) 15. 20. 60.
I 1071.1090.1072.1067.1067.
ReferenceCavaleiro, Salgueiro, et al., 2002Flamini, Cioni, et al., 2002Lota, de Rocca Serra, et al., 2002Pino, Marbot, et al., 2002Pino, Marbot, et al., 2002, 2
Comment MSDC-RI MSDC-RI MSDC-RI MSDC-RI MSDC-RI
Column type CapillaryCapillaryCapillaryCapillaryCapillary
Active phase DB-1BP-1BP-1SE-30CP Sil 5 CB
Column length (m) 50.50.50.50.50.
Carrier gas He He H2
Substrate
Column diameter (mm) 0.220.220.220.20.22
Phase thickness (μm) 0.250.250.25 0.13
Tstart (C) 60.60.60.50.40.
Tend (C) 220.220.230.250.300.
Heat rate (K/min) 2.2.2.6.4.
Initial hold (min)
Final hold (min) 20.20.35. 10.
I 1073.1071.1072.1083.1073.
ReferencePintore, Usai, et al., 2002Rezzi, Cavaleiro, et al., 2001Lota, de Rocca Serra, et al., 2000Paramonov, Khalilova, et al., 2000Pfeifhofer, 2000
Comment MSDC-RI MSDC-RI MSDC-RI MSDC-RI MSDC-RI
Column type CapillaryCapillaryCapillaryCapillaryCapillary
Active phase Mega 5MSDB-1DB-1OV-101OV-101
Column length (m) 30.60.30.50.50.
Carrier gas He  N2N2
Substrate
Column diameter (mm) 0.250.320.250.250.25
Phase thickness (μm) 0.251.0.25
Tstart (C) 40.-50.50.80.80.
Tend (C) 240.175.220.200.200.
Heat rate (K/min) 3.6.3.2.2.
Initial hold (min) 2.2.3.
Final hold (min)
I 1080.1083.41069.1076.1076.
ReferenceVerzera, Trozzi, et al., 2000Helmig, Klinger, et al., 1999Muselli, Hoi, et al., 1999Yang, Sugisawa, et al., 1992Yang, Sugisawa, et al., 1992
Comment MSDC-RI MSDC-RI MSDC-RI MSDC-RI MSDC-RI

Van Den Dool and Kratz RI, polar column, temperature ramp

Data compiled by: NIST Mass Spectrometry Data Center, William E. Wallace, director

Column type CapillaryCapillaryCapillaryCapillaryCapillary
Active phase BP-20BP-20RTX-WaxBP-20BP-20
Column length (m) 50.50.60.50.50.
Carrier gas HeHeHeHeHe
Substrate
Column diameter (mm) 0.220.220.220.220.22
Phase thickness (μm) 0.250.250.250.250.25
Tstart (C) 60.60.60.60.60.
Tend (C) 220.220.230.220.220.
Heat rate (K/min) 2.2.2.2.2.
Initial hold (min)
Final hold (min) 20.20.30.20.20.
I 1435.1432.1432.1432.1438.
ReferenceDuquesnoy, Castola, et al., 2007Lesueur, de Rocca Serra, et al., 2007Muselli, Rossi, et al., 2007Boti, Bighelli, et al., 2006Gonny, Cavaleiro, et al., 2006
Comment MSDC-RI MSDC-RI MSDC-RI MSDC-RI MSDC-RI
Column type CapillaryCapillaryCapillaryCapillaryCapillary
Active phase BP-20RTX-WaxSupelcowax-10Carbowax 20MRTX-Wax
Column length (m) 50.60.60.60.30.
Carrier gas He HeHeHe
Substrate
Column diameter (mm) 0.220.220.20.250.25
Phase thickness (μm) 0.250.250.20.250.25
Tstart (C) 60.60.60.45.45.
Tend (C) 220.220.200.250.250.
Heat rate (K/min) 2.2.2.2.3.
Initial hold (min)    0.176.
Final hold (min) 20.20.10.
I 1437.1417.1400.1417.1415.
ReferenceBoti J.B., Koukoua G., et al., 2005Cozzani, Muselli, et al., 2005Smadja, Rondeau, et al., 2005Verzera, Campisi, et al., 2005Shellie, Marriott, et al., 2003
Comment MSDC-RI MSDC-RI MSDC-RI MSDC-RI MSDC-RI
Column type CapillaryCapillaryCapillaryCapillaryCapillary
Active phase BP-20AT-WaxBP-20CP-Wax 52CBCP-Wax 52CB
Column length (m) 50.60.50.50.60.
Carrier gas HeHe  He
Substrate
Column diameter (mm) 0.220.320.220.250.25
Phase thickness (μm) 0.250.250.250.20.25
Tstart (C) 60.65.60.32.45.
Tend (C) 220.250.220.220.250.
Heat rate (K/min) 2.2.2.1.2.
Initial hold (min)  10. 1.0.17
Final hold (min) 20.60.20.
I 1432.1425.1431.1411.1417.
ReferenceLota, de Rocca Serra, et al., 2002Pino, Marbot, et al., 2002Pintore, Usai, et al., 2002Kjeldsen, Christensen, et al., 2001Verzera, Campisi, et al., 2001
Comment MSDC-RI MSDC-RI MSDC-RI MSDC-RI MSDC-RI
Column type CapillaryCapillaryCapillaryCapillaryCapillary
Active phase DB-WaxCP-Wax 52CBBP-20SP-1000DB-Wax
Column length (m) 60.25.50.85.60.
Carrier gas He HeHeHe
Substrate
Column diameter (mm) 0.530.250.220.50.32
Phase thickness (μm) 1.00.150.25
Tstart (C) 50.40.60.60.65.
Tend (C) 220.220.230.225.225.
Heat rate (K/min) 3.3.2.3.3.
Initial hold (min)  5.
Final hold (min)   35.
I 1438.1425.1432.1435.1435.
ReferenceBrophy, Goldsack, et al., 2000Chagonda, Makanda, et al., 2000Lota, de Rocca Serra, et al., 2000Brophy, Forster, et al., 1998Brophy, Goldsack, et al., 1997
Comment MSDC-RI MSDC-RI MSDC-RI MSDC-RI MSDC-RI

Phase change data

Data compiled by: Thermodynamics Research Center, NIST Boulder Laboratories, Chris Muzny director

Quantity Value Units Method Reference Comment
Tboil455. ± 9.KAVGN/AAverage of 6 values; Individual data points
Quantity Value Units Method Reference Comment
Tfus205.08KN/ABoord, Greenlee, et al., 1947Uncertainty assigned by TRC = 0.3 K
Tfus204.51KN/ABoord, Greenlee, et al., 1947Uncertainty assigned by TRC = 0.5 K

In addition to the Thermodynamics Research Center (TRC) data available from this site, much more physical and chemical property data is available from the following TRC products:

Kovats' RI, non-polar column, isothermal

View large format table.

Column type Active phase Temperature (C) I Reference Comment
CapillarySE-3065.1066.3Svob, Deur-Siftar, et al., 1974He; Column length: 25.5 m; Column diameter: 0.5 mm
CapillarySE-3065.1067.0Svob and Deur-Siftar, 1974He; Column length: 25.5 m; Column diameter: 0.5 mm

Kovats' RI, non-polar column, temperature ramp

View large format table.

Column type Active phase I Reference Comment
CapillaryDB-5MS1090.Angioni, Barra, et al., 200630. m/0.25 mm/0.25 μm, He, 3. K/min, 180. C @ 15. min; Tstart: 60. C
CapillaryHP-5MS1095.Hazzit, Baaliouamer, et al., 200630. m/0.25 mm/0.25 μm, He, 60. C @ 8. min, 2. K/min, 280. C @ 30. min
CapillarySPB-51094.Gauvin, Lecomte, et al., 200460. m/0.32 mm/1. μm, He, 4. K/min, 200. C @ 30. min; Tstart: 60. C
CapillaryHP-5MS1086.Siani, Garrido, et al., 200430. m/0.32 mm/0.25 μm, He, 70. C @ 5. min, 3. K/min; Tend: 250. C
CapillaryHP-5MS1078.Gkinis, Tzakou, et al., 200330. m/0.25 mm/0.25 μm, He, 3. K/min; Tstart: 60. C; Tend: 280. C
CapillaryCP Sil 5 CB1077.Ogunwande, Olawore, et al., 200325. m/0.25 mm/0.15 μm, He, 3. K/min; Tstart: 50. C; Tend: 230. C
CapillaryCP Sil 5 CB1077.Ogunwande, Olawore, et al., 2003, 225. m/0.25 mm/0.15 μm, H2, 3. K/min; Tstart: 50. C; Tend: 230. C
CapillaryDB-51076.El-Ghorab, Fadel, et al., 200225. m/0.22 mm/0.25 μm, He, 3. K/min; Tstart: 60. C; Tend: 240. C
CapillaryCP Sil 5 CB1077.Kasali, Adio, et al., 2002He, 3. K/min; Column length: 25. m; Column diameter: 0.25 mm; Tstart: 50. C; Tend: 230. C
CapillaryBP-11079.Raina, Lal, et al., 200260. m/0.32 mm/0.25 μm, N2, 5. K/min; Tstart: 60. C; Tend: 220. C
CapillaryHP-5MS1088.Salido, Altarejos, et al., 200230. m/0.25 mm/0.25 μm, He, 3. K/min; Tstart: 50. C; Tend: 250. C
CapillaryPTE-51090.Gudzic, Dordevic, et al., 200160. m/0.32 mm/0.39 μm, H2, 4.3 K/min; Tstart: 60. C; Tend: 285. C
CapillarySE-541089.Adams, 200030. m/0.26 mm/0.25 μm, 3. K/min; Tstart: 60. C; Tend: 246. C
CapillaryHP-51090.Ramos, Siani, et al., 200030. m/0.32 mm/0.25 μm, He, 3. K/min; Tstart: 70. C; Tend: 250. C
CapillaryDB-51080.Senatore and de Feo, 199930. m/0.25 mm/0.33 μm, He, 40. C @ 5. min, 2. K/min, 260. C @ 20. min
CapillaryHP-5MS1085.Siani, Ramos, et al., 199930. m/0.32 mm/0.25 μm, He, 70. C @ 5. min, 3. K/min; Tend: 250. C
CapillaryDB-51080.de Feo, Porta, et al., 199830. m/0.25 mm/0.25 μm, He, 40. C @ 5. min, 2. K/min, 250. C @ 20. min

Kovats' RI, non-polar column, custom temperature program

View large format table.

Column type Active phase I Reference Comment
CapillaryHP-5MS1092.Alissandrakis E., Tarantilis P.A., et al., 200730. m/0.25 mm/0.25 μm, He; Program: 40C(3min) => 3C/min => 160C => 10C/min => 200C
CapillaryDB-51088.Roscigno, 199830. m/0.25 mm/0.25 μm; Program: 50C(5min) => 2C/min => 250C (60min) => 2C/min => 270C => 1C/min => 290C

Kovats' RI, polar column, isothermal

View large format table.

Column type Active phase Temperature (C) I Reference Comment
CapillaryPEG-20M100.1428.Morishita, Okano, et al., 1980Column length: 75. m; Column diameter: 0.25 mm
CapillaryCarbowax 20M90.1394.1Döring, Estel, et al., 1974Column length: 100. m; Column diameter: 0.2 mm

Kovats' RI, polar column, temperature ramp

View large format table.

Column type Active phase I Reference Comment
CapillaryStabilwax1452.Hazzit, Baaliouamer, et al., 200630. m/0.32 mm/1. μm, N2, 50. C @ 3. min, 2. K/min, 220. C @ 15. min
CapillaryHP-Wax1455.Gauvin, Lecomte, et al., 200450. m/0.2 mm/0.4 μm, He, 4. K/min, 230. C @ 30. min; Tstart: 60. C
CapillaryDB-Wax1433.Umano, Hagi, et al., 1994He, 40. C @ 2. min, 2. K/min; Column length: 60. m; Column diameter: 0.25 mm; Tend: 200. C
CapillaryDB-Wax1421.Umano and Shibamoto, 198840. C @ 10. min, 2. K/min; Column length: 60. m; Column diameter: 0.25 mm; Tend: 220. C

Van Den Dool and Kratz RI, non-polar column, custom temperature program

View large format table.

Column type Active phase I Reference Comment
CapillarySE-521092.Bruni, Bianchi, et al., 200730. m/0.32 mm/0.15 μm, He; Program: 45C => 1C/min => 100C => 5C/min => 250C(10min)
CapillaryBPX-51096.Dharmawan, Kasapis, et al., 200730. m/0.25 mm/0.25 μm, He; Program: 35C => 4C/min => 200C => 30C/min => 300C (3min)
CapillaryBPX-51103.Cardeal, da Silva, et al., 200630. m/0.25 mm/0.25 μm; Program: 35C(5min) => 3C/min => 210C => 40C/min => 240C (4min)
CapillaryHP-5MS1091.Akpulat, Tepe, et al., 200530. m/0.25 mm/0.25 μm, He; Program: 50C (3min) => 3C/min => 200C => 6C/min => 240C
CapillarySPB-11072.Sanz, Soria, et al., 200427. m/0.25 mm/0.25 μm, He; Program: 60C => 3C/min => 180C => 8C/min => 250C (5min)
CapillaryDB-5MS1090.Kim, Lee, et al., 200330. m/0.25 mm/0.25 μm, He; Program: 40C(5min) => 4C/min => 160C => 8C/min => 240C (15min)

Van Den Dool and Kratz RI, polar column, custom temperature program

View large format table.

Column type Active phase I Reference Comment
CapillarySupelcowax-101456.Bianchi, Cantoni, et al., 200730. m/0.25 mm/0.25 μm; Program: 35C(8min) => 4C/min => 60C => 6C/min => 160C => 20C/min => 220C(1min)
CapillaryCP-Wax 52CB1439.Condurso, Verzera, et al., 200660. m/0.25 mm/0.25 μm, He; Program: 45C(5min) => 10C/min => 80C => 2C/min => 240C

Normal alkane RI, non-polar column, custom temperature program

View large format table.

Column type Active phase I Reference Comment
CapillaryPolydimethyl siloxane with 5 % Ph groups1091.Robinson, Adams, et al., 2012Program: not specified
CapillaryPolydimethyl siloxane with 5 % Ph groups1097.Robinson, Adams, et al., 2012Program: not specified
CapillaryHP-5 MS1118.Bai, Liu, et al., 201130. m/0.25 mm/0.25 μm, Helium; Program: 60 0C (1 min) 10 0C/min -> 180 0C (1 min) 20 0C/min -> 280 0C (15 min)
CapillaryDB-51105.Miyazaki, Plotto, et al., 201160. m/0.25 mm/1.00 μm, Helium; Program: 40 0C 4 0C/min -> 230 0C 100 0C/min -> 260 0C (11.7 min)
CapillaryDB-51096.Courtois, Paine, et al., 200930. m/0.25 mm/0.25 μm, Helium; Program: 50 0C m6 0C/min -> 140 0C 5 0C/min -> 160 0C (1 min) 10 0C/min -> 200 0C
CapillaryDB-11080.Delort and Jaquier, 200960. m/0.25 mm/0.25 μm, Helium; Program: 50 0C (5 min) 3 0C/min -> 120 0C 5 0C/min -> 250 0C (3 min) 15 0C/min -> 300 0C (20 min)
CapillarySLB-5 MS1093.Costa, De Fina, et al., 200830. m/0.25 mm/0.25 μm, Helium; Program: 50 0C 3 0C/min -> 250 0C (1 min) 10 0C/min -> 300 0C (5 min)
CapillarySLB-5 MS1089.Costa, De Fina, et al., 200830. m/0.25 mm/0.25 μm, Helium; Program: not specified
CapillaryCB-11067.Kannaste, Vongvanich, et al., 200830. m/0.25 mm/0.25 μm, Helium; Program: 40 0C (2 min) 4 0C/min -> 180 0C 20 0C/min -> 220 0C (1 min)
CapillaryCB-11075.Kannaste, Vongvanich, et al., 200830. m/0.25 mm/0.25 μm, Helium; Program: not specified
CapillaryDB-5 MS1090.Silva, Doria, et al., 200830. m/0.25 mm/0.25 μm; Program: 80 0C (1.5 min) 4 pC/min -> 180 0C 10 0C/min -> 300 0C (10 min)
CapillaryDB-5 MS1100.Cajka, Hajslova, et al., 200730. m/0.25 mm/0.25 μm, Helium; Program: 45 0C (0.75 min) 10 0C/min -> 200 0C 30 0C/min -> 245 0C (1.25 min)
CapillaryHP-5MS1080.Formisano, Mignola, et al., 200730. m/0.25 mm/0.25 μm, He; Program: 40C(5min) => 2C/min => 250C(15min) => 10C/min => 270C
CapillaryBPX-51103.Salamci, Kordali, et al., 200730. m/0.25 mm/0.25 μm, He; Program: 50C => 3C/min => 150C(10min) => 10C/min => 250C
CapillarySE-521091.Tognolini, Barocelli, et al., 200630. m/0.32 mm/0.15 μm, He; Program: 45C => 1C/min => 100C => 5C/min => 250C (10min)
CapillaryRTX-51069.Ádámová, Orinák, et al., 200530. m/0.25 mm/0.25 μm, N2; Program: not specified
CapillaryCP-Sil5 CB MS1070.Iraqi, Vermeulen, et al., 200550. m/0.32 mm/1.2 μm; Program: 36C(2min) => 20C/min => 85C => 1C/min => 145C => 3C/min => 250C(30min)
CapillaryCP Sil 8 CB1091.Butkienë, Nivinskienë, et al., 200450. m/0.32 mm/0.25 μm, He; Program: 50C(5min) => 2C/min => 90C => 15C/min => 240C(4min)
CapillarySE-301074.Vinogradov, 2004Program: not specified
CapillarySE-301080.Vinogradov, 2004Program: not specified
CapillaryOV-1011076.Yang, 2001N2; Column length: 50. m; Column diameter: 0.25 mm; Program: not specified
CapillaryDB-51090.Andrade, Maia, et al., 200030. m/0.25 mm/0.25 μm, He; Program: 40C => 2C/min => 60C => 4C/min => 260C
CapillaryDB-11059.da Silva, Pedro, et al., 200030. m/0.25 mm/0.25 μm, H2; Program: 40 0C 3 K/min -> 175 0C 15 K/min -> 240 0C (10 min)
CapillaryDB-11059.Pedro, da Silva, et al., 199930. m/0.25 mm/0.25 μm, He; Program: 45C => 3C/min => 170C => 15C/min => 300C(10min)
CapillaryCP Sil 5 CB1081.Guyot, Bouseta, et al., 199850. m/0.32 mm/1.2 μm, He; Program: 30C => 55C/min => 85C => 1C/min => 145C => 3C/min => 250C
CapillaryRTX-51088.Masanetz and Grosch, 199830. m/0.53 mm/1.5 μm, He; Program: 35 0C (2 min) 40 0C/min -> 60 0C (1 min) 6 0C/min -> 230 0C
CapillaryCP Sil 5 CB1075.Weyerstahl, Marschall, et al., 1998He; Column length: 25. m; Phase thickness: 0.39 μm; Program: not specified
CapillaryDB-51089.Yusuf, Begum, et al., 199830. m/0.25 mm/0.25 μm, He; Program: 60C => 3C/min => 240C => 30C/min => 300C
CapillarySE-541118.Blank, Fischer, et al., 198930. m/0.32 mm/0.3 μm, He; Program: 35C(2min) => 40C/min => 50C(2min) => 6C/min => 230C(10min)

Normal alkane RI, polar column, isothermal

View large format table.

Column type Active phase Temperature (C) I Reference Comment
CapillaryCarbowax 20M90.1394.Sutter, Peterson, et al., 1997

Normal alkane RI, polar column, temperature ramp

View large format table.

Column type Active phase I Reference Comment
CapillaryHP-Innowax1414.Charoensiddhi and Anprung, 200830. m/0.25 mm/0.25 μm, Helium, 50. C @ 10. min, 15. K/min, 240. C @ 19. min
CapillaryTC-FFAP1451.Kurose, Okamura, et al., 2007He, 3. K/min, 220. C @ 30. min; Column diameter: 0.25 mm; Phase thickness: 0.25 μm; Tstart: 60. C
CapillarySupelcowax-101442.Pinto, Salgueiro, et al., 200730. m/0.2 mm/0.2 μm, He, 3. K/min, 220. C @ 15. min; Tstart: 70. C
CapillarySupelcowax-101430.Vichi, Riu-Aumatell, et al., 200730. m/0.25 mm/0.25 μm, He, 40. C @ 5. min, 3. K/min, 250. C @ 10. min
CapillaryBP-201430.Boti, Muselli, et al., 200650. m/0.22 mm/0.25 μm, He, 2. K/min, 220. C @ 20. min; Tstart: 60. C
CapillarySupelcowax 101439.Cavaleiro, Pinto, et al., 200630. m/0.20 mm/0.20 μm, Helium, 3. K/min, 220. C @ 15. min; Tstart: 70. C
CapillaryBP-201432.Fanciullino, Tomi, et al., 200650. m/0.22 mm/0.25 μm, He, 2. K/min, 220. C @ 20. min; Tstart: 60. C
CapillaryHP-Wax1459.Marzouk, Mansour, et al., 200630. m/0.25 mm/0.25 μm, Nitrogen, 5. K/min, 280. C @ 5. min; Tstart: 50. C
CapillaryHP-20M1459.Marzouk, Neffati, et al., 200630. m/0.25 mm/0.25 μm, N2, 5. K/min, 250. C @ 10. min; Tstart: 50. C
CapillaryCarbowax 20M1397.Fernandez, Lizzani-Cuvelier, et al., 200550. m/0.2 mm/0.25 μm, 60. C @ 60. min, 2. K/min; Tend: 250. C
CapillarySupelcowax-101429.Wong, Lee, et al., 200530. m/0.25 mm/0.25 μm, He, 50. C @ 3. min, 4. K/min, 220. C @ 30. min
CapillaryBP-201430.Blanc, Muselli, et al., 200450. m/0.22 mm/0.25 μm, 2. K/min, 220. C @ 20. min; Tstart: 60. C
CapillaryInnowax FSC1452.Lourens, Reddy, et al., 2004Helium, 60. C @ 10. min, 4. K/min; Column length: 60. m; Column diameter: 0.25 mm; Tend: 220. C
CapillarySupelcowax-101428.Orav, Kailas, et al., 200350. m/0.2 mm/0.25 μm, He, 2. K/min; Tstart: 70. C; Tend: 230. C
CapillarySupelcowax-101428.Orav, Kailas, et al., 200260. m/0.2 mm/0.5 μm, He, 2. K/min; Tstart: 70. C; Tend: 220. C
CapillaryBP-201432.Lota, de Rocca Serra, et al., 200150. m/0.22 mm/0.25 μm, He, 2. K/min, 230. C @ 35. min; Tstart: 60. C
CapillaryBP-201465.Mallavarapu, Rao, et al., 200025. m/0.50 mm/0.25 μm, Nitrogen, 5. K/min; Tstart: 60. C; Tend: 200. C
CapillaryDB-Wax1447.Tamura, Boonbumrung, et al., 2000Nitrogen, 40. C @ 10. min, 2. K/min; Column length: 60. m; Column diameter: 0.25 mm; Tend: 200. C
CapillaryInnowax1452.Kaya, Baser, et al., 199960. m/0.25 mm/0.25 μm, He, 60. C @ 10. min; Tend: 220. C
CapillaryDB-Wax1437.Ngassoum, Yonkeu, et al., 199960. m/0.25 mm/0.25 μm, He, 4. K/min; Tstart: 60. C; Tend: 240. C
CapillaryBP-201457.Bignell, Dunlop, et al., 199825. m/0.33 mm/0.5 μm, H2, 5. K/min; Tstart: 80. C; Tend: 220. C
CapillaryBP-201457.Bignell, Dunlop, et al., 199725. m/0.33 mm/0.5 μm, H2, 5. K/min; Tstart: 80. C; Tend: 220. C
CapillaryBP-201457.Bignell, Dunlop, et al., 1997, 225. m/0.33 mm/0.5 μm, H2, 5. K/min; Tstart: 80. C; Tend: 220. C
CapillaryBP-201457.Bignell, Dunlop, et al., 1997, 325. m/0.33 mm/0.5 μm, H2, 5. K/min; Tstart: 80. C; Tend: 220. C
CapillaryBP-201457.Bignell, Dunlop, et al., 1997, 425. m/0.33 mm/0.5 μm, H2, 5. K/min; Tstart: 80. C; Tend: 220. C
CapillaryBP-201457.Bignell, Dunlop, et al., 1997, 525. m/0.33 mm/0.5 μm, 5. K/min; Tstart: 80. C; Tend: 220. C
CapillaryBP-201457.Bignell, Dunlop, et al., 1997, 625. m/0.33 mm/0.5 μm, H2, 5. K/min; Tstart: 80. C; Tend: 220. C
CapillarySP-10001435.Brophy, Goldsack, et al., 1996He, 3. K/min; Column length: 85. m; Column diameter: 0.50 mm; Tstart: 65. C; Tend: 225. C
CapillaryCarbowax 20M1432.Kollmannsberger, Nitz, et al., 199245. m/0.32 mm/1.0 μm, Hydrogen, 60. C @ 5. min, 2. K/min; Tend: 200. C
CapillaryFFAP1468.Brophy, Davies, et al., 198950. C @ 1. min, 10. K/min; Column length: 50. m; Tend: 180. C

Normal alkane RI, polar column, custom temperature program

View large format table.

Column type Active phase I Reference Comment
CapillaryDB-Wax1446.Miyazaki, Plotto, et al., 201160. m/0.25 mm/0.50 μm, Helium; Program: 40 0C 4 0C/min -> 230 0C 100 0C/min -> 260 0C (11.7 min)
CapillaryInnowax FSC1452.Polatoglu, Demirci, et al., 201060. m/0.25 mm/0.25 μm, Helium; Program: 60 0C (10 min) 4 0C/min -> 220 0C (10 min) 1 0C/min -> 240 0C
CapillaryHP Innowax FSP1452.Wedge, Klun, et al., 200960. m/0.25 mm/0.25 μm, Helium; Program: 60 0C (10 min) 4 0C/min -> 220 0C (10 min) 1 0C/min -> 240 0C (20 min)
CapillaryBP-201431.Pontes, Marques, et al., 200730. m/0.25 mm/0.25 μm, He; Program: 50C(1min) => 2.5C/min => 100C => 2C/min => 180C => 15C/min => 220C
CapillaryInnowax FSC1452.Baser K.H.C., Ozek G., et al., 200660. m/0.25 mm/0.25 μm, He; Program: 60C(10min) => 4C/min => 220C (10min) => 1C/min => 240C
CapillaryInnowax FSC1452.Baser, Özek, et al., 200660. m/0.25 mm/0.25 μm, He; Program: 60C(10min) => 4C/min >220C (10min) => 1C/min => 240C
CapillaryHP-Innowax FSC1452.Demirci B., Baser K.H.C., et al., 200660. m/0.25 mm/0.25 μm, N2; Program: 60C(10min) => 4C/min => 220C(10min) => 1C/min => 240C
CapillaryHP-Innowax FSC1452.Erdurak, Coskun, et al., 200660. m/0.25 mm/0.25 μm, He; Program: 60C(10min) => 4C/min => 220C (10min) => 1C/min => 240C
CapillaryHP-Innowax FSC1452.Kürkçüoglu, Hüsnü Can Baser, et al., 200660. m/0.25 mm/0.25 μm, He; Program: 60C(10min) => 4C/min => 220C (10min) => 1C/min => 240C
CapillaryHP-Innowax FSC1452.Suleimenov Y.M., Atazhanova G.A., et al., 200660. m/0.25 mm/0.25 μm, He; Program: 60(10min) => 4C/min => 220C(10min) => 1C/min => 240C
CapillaryHP-Innowax FSC1452.Tabanca, Demirci, et al., 200660. m/0.25 mm/0.25 μm, N2; Program: 60C(10min) => 4C/min => 220C => (10min) => 1C/min => 240C
CapillaryCarbowax 20M1417.Editorial paper, 2005Program: not specified
CapillaryInnowax FSC1452.Kosar, Özek, et al., 200560. m/0.25 mm/0.25 μm, He; Program: 60C(10min) => 4C/min => 220C(10min) => 1C/min => 240C
CapillaryHP-Innowax FSC1444.Sezik E., Kocakulak E., et al., 200560. m/0.25 mm/0.25 μm, He; Program: 60C(10min) => 4C/min => 220C(10min) => 1C/min => 240C
CapillaryHP-Innowax FSC1452.Tabanca, Demirci, et al., 200560. m/0.25 mm/0.25 μm, He; Program: 60C(10min) => 4C/min => 220C(10min) => 1C/min => 240C
CapillaryInnowax FSC1452.Baser, Özek, et al., 200460. m/0.25 mm/0.25 μm, He; Program: 60C(10min) => 4C/min => 220C(10min) => 1C/min => 240C
CapillaryHP-Innowax FSC1452.Demirci, Paper, et al., 200460. m/0.25 mm/0.25 μm, He; Program: 60C(10min) => 4C/min => 220C(10min) => 1C/min => 240C
CapillaryHP-Innowax FSC1452.Kivcak, Akay, et al., 200460. m/0.25 mm/0.25 μm, He; Program: 60C(10min) => 4C/min => 220C(10min) => 1C/min => 240C
CapillaryHP-Innowax FSC1452.Kaya, Demirci, et al., 200360. m/0.25 mm/0.25 μm, N2; Program: 60C(10min) => 4C/min => 220C(10min) => 1C/min => 240C
CapillaryInnowax1452.Tunaher, Kirimer, et al., 200360. m/0.25 mm/0.25 μm, He; Program: 60C(10min) => 4C/min => 220C(10min) => 1C/min => 240C (20min)
CapillaryInnowax FSC1452.Baser, Demirei, et al., 200260. m/0.25 mm/0.25 μm, He; Program: 60C(10min) => 4C/min => 220C(10min) => 1C/min => 240C
CapillaryInnowax1452.Baser, Nuriddinov, et al., 200260. m/0.25 mm/0.25 μm, He; Program: 60C(10min) => 4C/min => 220C(10min) => 1C/min => 240C
CapillaryInnowax FSC1452.Tunalier, Kirimer, et al., 200260. m/0.25 mm/0.25 μm; Program: 60C(10min) => 4C/min => 220C(10min) => 1C/min => 240C
CapillaryHP-Innowax FSC1452.Kirimer N., Tabanea N., et al., 200160. m/0.25 mm/0.25 μm, He; Program: 60C(10min) => 4C/min => 220C(10min) => 1C/min => 240C
CapillaryInnowax1444.Özcan, Akgül, et al., 200160. m/0.25 mm/0.25 μm, He; Program: 60C(10min) => 4C/min => 200C(10min) => 1C/min => 240C
CapillaryDB-Wax1450.Schneider, Razungles, et al., 200130. m/0.25 mm/0.5 μm, He; Program: 30C => 70C/min => 60C (3min) => 3C/min => 245C (20min)
CapillaryInnowax FSC1452.Tabanca N., Demirci F., et al., 200160. m/0.25 mm/0.25 μm, He; Program: 60C(10min) => 4C/min => 220C(10min) => 1C/min => 240C
CapillaryHP-Innowax1452.Tabanca, Kirimer, et al., 200160. m/0.25 mm/0.25 μm, He; Program: 60C(10min) => 4C/min => 220C(10min) => 1C/min => 240C
CapillaryInnowax1444.Baser, Tabanca, et al., 200060. m/0.25 mm/0.25 μm, He; Program: 60 0C (10 min) 4 K/min -> 220 0C (10 min) 1 K/min -> 240 0C
CapillaryInnowax FSC1452.Kirimer, Tabanca, et al., 199960. m/0.25 mm/0.25 μm, Helium; Program: 60 0C (10 min) 4 0C/min -> 220 0C (10 min) 1 0C/min -> 240 0C
CapillaryFFAP1429.Reddy, Angers, et al., 199825. m/0.2 mm/0.33 μm, H2; Program: 40C(5min) => 4C/min => 170C => 8C/min => 240C (12min)
CapillaryDB-Wax1447.Weyerstahl, Marschall, et al., 1998N2; Column length: 60. m; Phase thickness: 0.25 μm; Program: not specified
CapillaryPolyethylene Glycol1410.Vernin, Metzger, et al., 1990Program: not specified

References

Hunter and Lias, 1998
Hunter, E.P.; Lias, S.G.,
Evaluated Gas Phase Basicities and Proton Affinities of Molecules: An Update,
J. Phys. Chem. Ref. Data, 1998, 27, 3, 413-656, https://doi.org/10.1063/1.556018
. [all data]