Cyclohexene, 1-methyl-4-(1-methylethyl)-, (R)-
- Formula: C10H18
- Molecular weight: 138.2499
- IUPAC Standard InChIKey: FAMJUFMHYAFYNU-UHFFFAOYSA-N
- CAS Registry Number: 1195-31-9
- Chemical structure:
View 3d structure (requires JavaScript / HTML 5) - Species with the same structure:
- Other names: p-Menth-1-ene, (R)-(+)-; (+)-p-Menth-1-ene; (+)-Carvomenthene; (+)-1-p-Menthene; Cyclohexene, 1-methyl-4-(1-methylethyl)-, (+)-; (+)-p-Menthene; p-Menthene, (+)-; 4-Isopropyl-1-methyl-1-cyclohexene, (R)-; (R)-Carvomenthene; Cyclohexane, 1-methyl-4-(1-methylethyl)-, didehydro deriv., (R)-; (R)-4-(isopropyl)-1-methylcyclohexene

Phase change data

Data compiled as indicated in comments:
BS - Robert L. Brown and Stephen E. Stein
TRC - Thermodynamics Research Center, NIST Boulder Laboratories, Chris Muzny director
Quantity | Value | Units | Method | Reference | Comment |
---|---|---|---|---|---|
Tboil | 449.2 | K | N/A | Weast and Grasselli, 1989 | BS |
Tboil | 442.65 | K | N/A | Brooks and Humphrey, 1918 | Uncertainty assigned by TRC = 1.5 K; TRC |

References

Weast and Grasselli, 1989
CRC Handbook of Data on Organic Compounds, 2nd Editon, Weast,R.C and Grasselli, J.G., ed(s)., CRC Press, Inc., Boca Raton, FL, 1989, 1. [all data]
Brooks and Humphrey, 1918
Brooks, B.T.; Humphrey, I.,
The Action of Concentrated Sulfuric Acid on Olefins, with Particular Reference to the Refining of Petroleum Distillates,
J. Am. Chem. Soc., 1918, 40, 822. [all data]