Phenol, 2-cyclohexyl-
- Formula: C12H16O
- Molecular weight: 176.2548
- IUPAC Standard InChIKey: MVRPPTGLVPEMPI-UHFFFAOYSA-N
- CAS Registry Number: 119-42-6
- Chemical structure:
View 3d structure (requires JavaScript / HTML 5) - Other names: Phenol, o-cyclohexyl-; o-Cyclohexylphenol; 2-Cyclohexylphenol

Phase change data

Data compiled by: Thermodynamics Research Center, NIST Boulder Laboratories, Chris Muzny director
Quantity | Value | Units | Method | Reference | Comment |
---|---|---|---|---|---|
Tfus | 327.9 | K | N/A | White and Bishop, 1940 | Uncertainty assigned by TRC = 0.7 K |

Reaction thermochemistry data

Data compiled by: Hussein Y. Afeefy, Joel F. Liebman, and Stephen E. Stein
Individual Reactions
By formula: C12H16O = C12H16O
Quantity | Value | Units | Method | Reference | Comment |
---|---|---|---|---|---|
ΔrH° | -2.4 ± 0.4 | kJ/mol | Eqk | Nesterova, Pimerzin, et al., 1989 | liquid phase; Isomerization |

References

White and Bishop, 1940
White, A.H.; Bishop, W.S.,
Dielectric Evidence of Molecular Rotation in the Crystals of Certain Non-aromatic Compounds,
J. Am. Chem. Soc., 1940, 62, 8-16. [all data]
Nesterova, Pimerzin, et al., 1989
Nesterova, T.N.; Pimerzin, A.A.; Rozhnov, A.M.; Karlina, T.N.,
Equilibria for the isomerization of (secondary-alkyl)phenols and cyclohexylphenols,
J. Chem. Thermodyn., 1989, 21, 385-395. [all data]
Bol'shakov, et al., 1969
Bol'shakov, G.F., et al.,
Ultraviolet spectra of heteroorganic compounds, 1969, 243. [all data]