1-Bromo-2,4-dichlorobenzene
- Formula: C6H3BrCl2
- Molecular weight: 225.898
- IUPAC Standard InChIKey: ISHYFWKKWKXXPL-UHFFFAOYSA-N
- CAS Registry Number: 1193-72-2
- Chemical structure:
View 3d structure (requires JavaScript / HTML 5) - Other names: Benzene, 1-bromo-2,4-dichloro-

Phase change data

Data compiled by: Robert L. Brown and Stephen E. Stein
Quantity | Value | Units | Method | Reference | Comment |
---|---|---|---|---|---|
Tboil | 508.2 | K | N/A | Weast and Grasselli, 1989 | |
Tboil | 508. | K | N/A | Buckingham and Donaghy, 1982 | |
Quantity | Value | Units | Method | Reference | Comment |
Tfus | 298. | K | N/A | Buckingham and Donaghy, 1982 |
Reduced pressure boiling point
Tboil (K) | Pressure (bar) | Reference |
---|---|---|
384.2 | 0.028 | Weast and Grasselli, 1989 |
384. | 0.028 | Buckingham and Donaghy, 1982 |

References

Weast and Grasselli, 1989
CRC Handbook of Data on Organic Compounds, 2nd Editon, Weast,R.C and Grasselli, J.G., ed(s)., CRC Press, Inc., Boca Raton, FL, 1989, 1. [all data]
Buckingham and Donaghy, 1982
Buckingham, J.; Donaghy, S.M.,
Dictionary of Organic Compounds: Fifth Edition, Chapman and Hall, New York, 1982, 1. [all data]