1,3-Dioxolane, 2,2,4-trimethyl-
- Formula: C6H12O2
- Molecular weight: 116.1583
- IUPAC Standard InChIKey: ALTFLAPROMVXNX-UHFFFAOYSA-N
- CAS Registry Number: 1193-11-9
- Chemical structure:
View 3d structure (requires JavaScript / HTML 5) - Other names: 2,2,4-Trimethyl-1,3-dioxolane; 2,2,4-Trimethyldioxolane

Reaction thermochemistry data

Data compiled by: Hussein Y. Afeefy, Joel F. Liebman, and Stephen E. Stein
Individual Reactions
By formula: C3H8O2 + C3H6O = C6H12O2 + H2O
Quantity | Value | Units | Method | Reference | Comment |
---|---|---|---|---|---|
ΔrH° | -3. | kJ/mol | Eqk | Anteunis and Rommelaere, 1970 | liquid phase |

References

Anteunis and Rommelaere, 1970
Anteunis, M.; Rommelaere, Y.,
NMR experiments on acetals. XXIX. The ease of acetonide formation of some glycols,
Bull. Soc. Chim. Belg., 1970, 79, 523-530. [all data]