Cyclopentane, 1,2-dimethyl-, cis-
- Formula: C7H14
- Molecular weight: 98.1861
- IUPAC Standard InChIKey: RIRARCHMRDHZAR-KNVOCYPGSA-N
- CAS Registry Number: 1192-18-3
- Chemical structure:
View 3d structure (requires JavaScript / HTML 5) - Stereoisomers:
- Other names: cis-1,2-Dimethylcyclopentane; 1,cis-2-Dimethylcyclopentane; 1,2-Dimethyl- cis-cyclopentane; 1,2-Dimethylcyclopentane, cis; 1-c-2-Dimethylcyclopentane; c-1,2-Dimethylcyclopentane

Gas phase thermochemistry data

Data compiled as indicated in comments:
ALS - Hussein Y. Afeefy, Joel F. Liebman, and Stephen E. Stein
GT - Glushko Thermocenter, Russian Academy of Sciences, Moscow
Quantity | Value | Units | Method | Reference | Comment |
---|---|---|---|---|---|
ΔfH°gas | -129.5 ± 1.3 | kJ/mol | Cm | Johnson, Prosen, et al., 1949 | ALS |
Quantity | Value | Units | Method | Reference | Comment |
S°gas | 366.14 | J/mol*K | N/A | Stull D.R., 1969 | This value was obtained using low temperature data of [ Gross M.E., 1953].; GT |
Constant pressure heat capacity of gas
Cp,gas (J/mol*K) | Temperature (K) | Reference | Comment |
---|---|---|---|
44.72 | 50. | Thermodynamics Research Center, 1997 | p=1 bar. Recommended values are in close agreement with those calculated by a method of increments [ Epstein M.B., 1949] at low temperatures. Discrepancies increase up to 2-4 J/mol*K at T=1500 K.; GT |
61.67 | 100. | ||
76.71 | 150. | ||
92.68 | 200. | ||
122.5 | 273.15 | ||
134.1 | 298.15 | ||
135.0 | 300. | ||
182.4 | 400. | ||
225.2 | 500. | ||
261.0 | 600. | ||
290.8 | 700. | ||
315.9 | 800. | ||
337.3 | 900. | ||
355.6 | 1000. | ||
371.3 | 1100. | ||
384.8 | 1200. | ||
396.4 | 1300. | ||
406.5 | 1400. | ||
415.2 | 1500. | ||
432.5 | 1750. | ||
445.0 | 2000. | ||
454.2 | 2250. | ||
461.1 | 2500. | ||
466.5 | 2750. | ||
470.7 | 3000. |

Condensed phase thermochemistry data

Data compiled as indicated in comments:
ALS - Hussein Y. Afeefy, Joel F. Liebman, and Stephen E. Stein
DH - Eugene S. Domalski and Elizabeth D. Hearing
Quantity | Value | Units | Method | Reference | Comment |
---|---|---|---|---|---|
ΔfH°liquid | -165.4 ± 1.3 | kJ/mol | Cm | Johnson, Prosen, et al., 1949 | ALS |
Quantity | Value | Units | Method | Reference | Comment |
ΔcH°liquid | -4590.1 ± 1.3 | kJ/mol | Cm | Johnson, Prosen, et al., 1949 | Corresponding ΔfHºliquid = -165.3 kJ/mol (simple calculation by NIST; no Washburn corrections); ALS |
Quantity | Value | Units | Method | Reference | Comment |
S°liquid | 269.16 | J/mol*K | N/A | Gross, Oliver, et al., 1953 | DH |
Constant pressure heat capacity of liquid
Cp,liquid (J/mol*K) | Temperature (K) | Reference | Comment |
---|---|---|---|
190.66 | 302.84 | Gross, Oliver, et al., 1953 | T = 13 to 300 K. Unsmoothed experimental datum.; DH |

Phase change data

Data compiled as indicated in comments:
BS - Robert L. Brown and Stephen E. Stein
TRC - Thermodynamics Research Center, NIST Boulder Laboratories, Chris Muzny director
AC - William E. Acree, Jr., James S. Chickos
DRB - Donald R. Burgess, Jr.
CAL - James S. Chickos, William E. Acree, Jr., Joel F. Liebman, Students of Chem 202 (Introduction to the Literature of Chemistry), University of Missouri -- St. Louis
DH - Eugene S. Domalski and Elizabeth D. Hearing
Quantity | Value | Units | Method | Reference | Comment |
---|---|---|---|---|---|
Tboil | 372.5 ± 0.3 | K | AVG | N/A | Average of 13 values; Individual data points |
Quantity | Value | Units | Method | Reference | Comment |
Tfus | 230. ± 70. | K | AVG | N/A | Average of 9 values; Individual data points |
Quantity | Value | Units | Method | Reference | Comment |
Ttriple | 219.45 | K | N/A | Gross, Oliver, et al., 1953, 2 | Crystal phase 1 phase; Uncertainty assigned by TRC = 0.05 K; TRC |
Ttriple | 219.430 | K | N/A | Huffman, 1948 | Crystal phase 1 phase; Uncertainty assigned by TRC = 0.06 K; TRC |
Ttriple | 219.430 | K | N/A | Huffman, 1948 | Crystal phase 1 phase; Uncertainty assigned by TRC = 0.04 K; TRC |
Ttriple | 219.430 | K | N/A | Huffman, 1947 | Crystal phase 1 phase; Uncertainty assigned by TRC = 0.04 K; TRC |
Quantity | Value | Units | Method | Reference | Comment |
ΔvapH° | 35.8 | kJ/mol | N/A | Reid, 1972 | AC |
ΔvapH° | 35.9 | kJ/mol | N/A | Johnson, Prosen, et al., 1949 | DRB |
Enthalpy of vaporization
ΔvapH (kJ/mol) | Temperature (K) | Method | Reference | Comment |
---|---|---|---|---|
35.5 | 308. | A | Stephenson and Malanowski, 1987 | Based on data from 293. to 375. K.; AC |
35.2 | 313. | N/A | Forziati, Norris, et al., 1949 | Based on data from 298. to 373. K.; AC |
Enthalpy of fusion
ΔfusH (kJ/mol) | Temperature (K) | Reference | Comment |
---|---|---|---|
1.66 | 219.4 | Domalski and Hearing, 1996 | AC |
Entropy of fusion
ΔfusS (J/mol*K) | Temperature (K) | Reference | Comment |
---|---|---|---|
47.01 | 141.5 | Domalski and Hearing, 1996 | CAL |
7.55 | 219.4 |
Enthalpy of phase transition
ΔHtrs (kJ/mol) | Temperature (K) | Initial Phase | Final Phase | Reference | Comment |
---|---|---|---|---|---|
6.6689 | 141.50 | crystaline, II | crystaline, I | Gross, Oliver, et al., 1953 | DH |
1.6573 | 219.45 | crystaline, I | liquid | Gross, Oliver, et al., 1953 | DH |
Entropy of phase transition
ΔStrs (J/mol*K) | Temperature (K) | Initial Phase | Final Phase | Reference | Comment |
---|---|---|---|---|---|
47.13 | 141.50 | crystaline, II | crystaline, I | Gross, Oliver, et al., 1953 | DH |
7.55 | 219.45 | crystaline, I | liquid | Gross, Oliver, et al., 1953 | DH |

Reaction thermochemistry data

Data compiled by: Hussein Y. Afeefy, Joel F. Liebman, and Stephen E. Stein
Individual Reactions
By formula: 2H2 + 2C7H12 = C7H14 + C7H14
Quantity | Value | Units | Method | Reference | Comment |
---|---|---|---|---|---|
ΔrH° | -94.35 ± 0.75 | kJ/mol | Chyd | Allinger, Dodziuk, et al., 1982 | liquid phase; solvent: Hexane |

Gas phase ion energetics data

Data compiled by: Sharon G. Lias, Rhoda D. Levin, and Sherif A. Kafafi
Ionization energy determinations
IE (eV) | Method | Reference |
---|---|---|
9.92 ± 0.05 | EI | Herzschuh and Sicker, 1981 |
Appearance energy determinations
Ion | AE (eV) | Other Products | Method | Reference | Comment |
---|---|---|---|---|---|
C5H11+ | 10.47 ± 0.05 | C2H5 | EI | Herzschuh and Sicker, 1981 | |
C6H11+ | 10.57 ± 0.05 | CH3 | EI | Herzschuh and Sicker, 1981 |

Kovats' RI, non-polar column, isothermal

View large format table.

Column type Active phase Temperature (C) I Reference Comment
CapillaryOV-1010.711.Skrbic, 1997
CapillaryOV-145.719.5Guan, Kiraly, et al., 198925. m/0.31 mm/0.52 μm, He
CapillaryOV-165.723.8Guan, Kiraly, et al., 198925. m/0.31 mm/0.52 μm, He
CapillaryOV-10140.718.Laub and Purnell, 1988
CapillaryOV-10160.722.Laub and Purnell, 1988
CapillaryOV-10180.726.Laub and Purnell, 1988
CapillarySqualane50.720.Lunskii and Paizanskaya, 1988He; Column length: 50. m; Column diameter: 0.22 mm
CapillarySqualane70.724.2Lunskii and Paizanskaya, 1988He; Column length: 50. m; Column diameter: 0.22 mm
CapillaryNonpolar45.721.Stoyanov and Dimov, 1987
CapillaryNonpolar52.5722.Stoyanov and Dimov, 1987
CapillaryNonpolar60.724.Stoyanov and Dimov, 1987
CapillaryOV-10140.719.0Boneva and Dimov, 1986100. m/0.27 mm/0.9 μm
CapillaryOV-10150.721.4Boneva and Dimov, 1986100. m/0.27 mm/0.9 μm
CapillaryOV-10160.723.2Boneva and Dimov, 1986100. m/0.27 mm/0.9 μm
CapillaryOV-10170.725.2Boneva and Dimov, 1986100. m/0.27 mm/0.9 μm
CapillaryOV-10130.717.Chien, Furio, et al., 1983
CapillaryOV-10140.718.Chien, Furio, et al., 1983
CapillaryOV-10150.720.Chien, Furio, et al., 1983
CapillaryOV-10160.722.Chien, Furio, et al., 1983
CapillaryOV-10170.724.Chien, Furio, et al., 1983
CapillaryOV-10180.726.Chien, Furio, et al., 1983
CapillaryDB-160.722.6Lubeck and Sutton, 1983Column length: 60. m; Column diameter: 0.264 mm
CapillaryDB-160.723.Lubeck and Sutton, 198360. m/0.259 mm/1. μm
CapillaryOV-10150.721.Johansen and Ettre, 1982100. m/0.27 mm/0.20 μm
CapillaryOV-10150.721.Johansen and Ettre, 198255. m/0.27 mm/0.9 μm
CapillarySF-9650.720.Johansen and Ettre, 198291.4 m/0.31 mm/0.20 μm
CapillarySqualane50.720.8Bajus, Veselý, et al., 1979Column length: 100. m; Column diameter: 0.25 mm
CapillarySqualane70.724.2Bajus, Veselý, et al., 1979Column length: 100. m; Column diameter: 0.25 mm
CapillarySqualane86.729.1Nabivach and Kirilenko, 1979N2; Column length: 50. m
CapillarySqualane86.730.7Nabivach and Kirilenko, 1979N2; Column length: 50. m
CapillarySqualane100.723.Lulova, Leont'eva, et al., 1976He; Column length: 120. m; Column diameter: 0.25 mm
CapillarySqualane100.724.8Lulova, Leont'eva, et al., 1976He; Column length: 120. m; Column diameter: 0.25 mm
CapillarySqualane100.724.8Lulova, Leont'eva, et al., 1976He; Column length: 120. m; Column diameter: 0.25 mm
CapillarySqualane100.733.Dielmann, Schwengers, et al., 1974Column length: 100. m; Column diameter: 0.25 mm
CapillarySqualane60.723.Dielmann, Schwengers, et al., 1974Column length: 100. m; Column diameter: 0.25 mm
CapillarySqualane80.728.Dielmann, Schwengers, et al., 1974Column length: 100. m; Column diameter: 0.25 mm
CapillarySqualane50.721.Rijks and Cramers, 1974N2; Column length: 100. m; Column diameter: 0.25 mm
CapillarySqualane70.725.Rijks and Cramers, 1974N2; Column length: 100. m; Column diameter: 0.25 mm
CapillaryVacuum Grease Oil (VM-4)35.719.Sidorov, Petrova, et al., 1972
CapillaryVacuum Grease Oil (VM-4)45.722.Sidorov, Petrova, et al., 1972
CapillaryVacuum Grease Oil (VM-4)50.723.Sidorov, Petrova, et al., 1972
CapillaryVacuum Grease Oil (VM-4)58.726.Sidorov, Petrova, et al., 1972
CapillaryVacuum Grease Oil (VM-4)68.728.Sidorov, Petrova, et al., 1972
CapillarySqualane70.721.6Dimov and Schopov, 1971Column length: 100. m; Column diameter: 0.25 mm
PackedVacuum Grease Oil (VM-4)35.719.Sidorov, Ivanova, et al., 1971
PackedSE-30130.734.Mitra and Saha, 1970N2, Chromosorb W; Column length: 6.1 m
PackedSqualane27.717.Hively and Hinton, 1968He, Chromosorb P; Column length: 15. m; Column diameter: 0.25 mm
PackedSqualane49.722.Hively and Hinton, 1968He, Chromosorb P; Column length: 15. m; Column diameter: 0.25 mm
PackedSqualane67.725.Hively and Hinton, 1968He, Chromosorb P; Column length: 15. m; Column diameter: 0.25 mm
PackedSqualane86.729.Hively and Hinton, 1968He, Chromosorb P; Column length: 15. m; Column diameter: 0.25 mm
CapillarySqualane70.725.Schomburg, 1966

Kovats' RI, non-polar column, temperature ramp

View large format table.

Column type Active phase I Reference Comment
CapillaryOV-101715.Hayes and Pitzer, 1982110. m/0.25 mm/0.20 μm, He, 1. K/min; Tstart: 35. C; Tend: 200. C
CapillaryApiezon L732.Louis, 1971N2, 1. K/min; Column length: 50. m; Column diameter: 0.25 mm; Tstart: 60. C

Kovats' RI, non-polar column, custom temperature program

View large format table.

Column type Active phase I Reference Comment
CapillaryPetrocol DH-100716.7Haagen-Smit Laboratory, 1997He; Column length: 100. m; Column diameter: 0.2 mm; Program: 5C(10min) => 5C/min => 50C(48min) => 1.5C/min => 195C(91min)

Van Den Dool and Kratz RI, non-polar column, temperature ramp

View large format table.

Column type Active phase I Reference Comment
CapillaryPetrocol DH720.2Censullo, Jones, et al., 200350. m/0.25 mm/0.5 μm, He, 35. C @ 10. min, 3. K/min, 200. C @ 10. min
CapillarySPB-1714.94LECO Corporation, 200330. m/0.25 mm/0.25 μm, 40. C @ 2. min, 10. K/min, 250. C @ 2. min
CapillaryDB-5722.9Xu, van Stee, et al., 200330. m/0.25 mm/1. μm, He, 2.5 K/min; Tstart: 50. C; Tend: 200. C
CapillaryOV-101719.4Yin, Liu, et al., 2001N2, 1. K/min; Column length: 80. m; Column diameter: 0.22 mm; Tstart: 30. C; Tend: 130. C
CapillaryUltra-1710.76Haynes and Pitzer, 198550. m/0.22 mm/0.33 μm, He, 1. K/min; Tstart: -30. C; Tend: 240. C
CapillaryUltra-1713.09Haynes and Pitzer, 198550. m/0.22 mm/0.33 μm, He, 2. K/min; Tstart: -30. C; Tend: 240. C
CapillaryUltra-1714.60Haynes and Pitzer, 198550. m/0.22 mm/0.33 μm, He, 3. K/min; Tstart: -30. C; Tend: 240. C
CapillaryUltra-2715.40Haynes and Pitzer, 198550. m/0.22 mm/0.33 μm, He, 1. K/min; Tstart: -30. C; Tend: 240. C
CapillaryUltra-2717.85Haynes and Pitzer, 198550. m/0.22 mm/0.33 μm, He, 2. K/min; Tstart: -30. C; Tend: 240. C
CapillaryUltra-2719.43Haynes and Pitzer, 198550. m/0.22 mm/0.33 μm, He, 3. K/min; Tstart: -30. C; Tend: 240. C
CapillaryOV-101715.Hayes and Pitzer, 1981108. m/0.25 mm/0.2 μm, 1. K/min; Tstart: 35. C; Tend: 200. C

Normal alkane RI, non-polar column, isothermal

View large format table.

Column type Active phase Temperature (C) I Reference Comment
CapillaryMethyl Silicone50.721.N/AN2; Column length: 74.6 m; Column diameter: 0.28 mm
CapillaryOV-10150.721.Wu and Lu, 1984
CapillaryOV-10170.726.Wu and Lu, 1984
CapillarySqualane86.721.Vigdergauz and Martynov, 1971He; Column length: 150. m; Column diameter: 0.35 mm

Normal alkane RI, non-polar column, temperature ramp

View large format table.

Column type Active phase I Reference Comment
CapillaryPolydimethyl siloxane: CP-Sil 5 CB720.Bramston-Cook, 201360. m/0.25 mm/1.0 μm, Helium, 45. C @ 1.45 min, 3.6 K/min, 210. C @ 2.72 min
CapillaryPetrocol DH717.Supelco, 2012100. m/0.25 mm/0.50 μm, Helium, 20. C @ 15. min, 15. K/min, 220. C @ 30. min
CapillaryPONA720.Zhang, Ding, et al., 200950. m/0.20 mm/0.50 μm, Nitrogen, 35. C @ 15. min, 2. K/min, 200. C @ 10. min
CapillaryOV-101717.Orav, Kailas, et al., 199950. m/0.20 mm/0.50 μm, Helium, 30. C @ 6. min, 1. K/min; Tend: 100. C

Normal alkane RI, non-polar column, custom temperature program

View large format table.

Column type Active phase I Reference Comment
CapillaryMethyl Silicone721.Feng and Mu, 2007Program: not specified
CapillaryMethyl Silicone724.Zenkevich and Marinichev, 2001Program: not specified
CapillaryMethyl Silicone717.Spieksma, 1999Program: not specified
CapillarySE-54726.Zhu and He, 1999Program: not specified
CapillarySE-54728.Zhu and He, 1999Program: not specified
CapillaryOV-101711.Skrbic and Cvejanov, 1993Program: not specified
CapillaryOV-1, SE-30, Methyl silicone, SP-2100, OV-101, DB-1, etc.722.Waggott and Davies, 1984Hydrogen; Column length: 50. m; Column diameter: 0.32 mm; Program: not specified

References

Johnson, Prosen, et al., 1949
Johnson, W.H.; Prosen, E.J.; Rossini, F.D.,
Heats of combustion and isomerization of the six C7H14 alkylcyclopentanes,
J. Res. NBS, 1949, 42, 251-255. [all data]
Stull D.R., 1969
Stull D.R., Jr.,
The Chemical Thermodynamics of Organic Compounds. Wiley, New York, 1969. [all data]
Gross M.E., 1953
Gross M.E.,
Low-temperature thermal data for some C7H14 alkylcyclopentanes,
J. Am. Chem. Soc., 1953, 75, 2801-2804. [all data]
Thermodynamics Research Center, 1997
Thermodynamics Research Center,
Selected Values of Properties of Chemical Compounds., Thermodynamics Research Center, Texas A&M University, College Station, Texas, 1997. [all data]
Epstein M.B., 1949
Epstein M.B.,
Heats, equilibrium constants, and free energies of formation of the dimethylcyclopentanes,
J. Res. Nat. Bur. Stand., 1949, 43, 245-250. [all data]
Gross, Oliver, et al., 1953
Gross, M.E.; Oliver, G.D.; Huffman, H.M.,
Low-temperature thermal data for some C7H14 alkylcyclopentanes,
J. Am. Chem. Soc., 1953, 75, 2801-2804. [all data]
Gross, Oliver, et al., 1953, 2
Gross, M.E.; Oliver, G.D.; Huffman, H.M.,
Low temperature thermal data for some C7H14 alkylcyclopentanes,
J. Am. Chem. Soc., 1953, 75, 2801. [all data]
Huffman, 1948
Huffman, H.M.,
Personal Commun., U. S. Bur. Mines, Bartlesville, OK, 1948. [all data]
Huffman, 1947
Huffman, H.M.,
Personal Communication, U. S. Bur. Mines, Bartlesville, OK, 1947. [all data]
Reid, 1972
Reid, Robert C.,
Handbook on vapor pressure and heats of vaporization of hydrocarbons and related compounds, R. C. Wilhort and B. J. Zwolinski, Texas A Research Foundation. College Station, Texas(1971). 329 pages.$10.00,
AIChE J., 1972, 18, 6, 1278-1278, https://doi.org/10.1002/aic.690180637
. [all data]
Stephenson and Malanowski, 1987
Stephenson, Richard M.; Malanowski, Stanislaw,
Handbook of the Thermodynamics of Organic Compounds, 1987, https://doi.org/10.1007/978-94-009-3173-2
. [all data]
Forziati, Norris, et al., 1949
Forziati, Alphonse F.; Norris, William R.; Rossini, Frederick D.,
Vapor pressures and boiling points of sixty API-NBS hydrocarbons,
J. RES. NATL. BUR. STAN., 1949, 43, 6, 555-17, https://doi.org/10.6028/jres.043.050
. [all data]
Domalski and Hearing, 1996
Domalski, Eugene S.; Hearing, Elizabeth D.,
Heat Capacities and Entropies of Organic Compounds in the Condensed Phase. Volume III,
J. Phys. Chem. Ref. Data, 1996, 25, 1, 1, https://doi.org/10.1063/1.555985
. [all data]
Allinger, Dodziuk, et al., 1982
Allinger, N.L.; Dodziuk, H.; Rogers, D.W.; Naik, S.N.,
Heats of hydrogenation and formation of some 5-membered ring compounds by molecular mechanics calculations and direct measurements,
Tetrahedron, 1982, 38, 1593-1597. [all data]