Furan, 2,3-dihydro-
- Formula: C4H6O
- Molecular weight: 70.0898
- IUPAC Standard InChIKey: JKTCBAGSMQIFNL-UHFFFAOYSA-N
- CAS Registry Number: 1191-99-7
- Chemical structure:
View 3d structure (requires JavaScript / HTML 5) - Other names: 2,3-Dihydrofuran; 4,5-Dihydrofuran

Gas phase thermochemistry data

Data compiled as indicated in comments:
ALS - Hussein Y. Afeefy, Joel F. Liebman, and Stephen E. Stein
GT - Glushko Thermocenter, Russian Academy of Sciences, Moscow
Quantity | Value | Units | Method | Reference | Comment |
---|---|---|---|---|---|
ΔfH°gas | -72.25 ± 0.41 | kJ/mol | Ccr | Steele, Chirico, et al., 1989 | ALS |
Constant pressure heat capacity of gas
Cp,gas (J/mol*K) | Temperature (K) | Reference | Comment |
---|---|---|---|
49.64 | 200. | Klots T.D., 1994 | Earlier thermodynamic functions of this molecule were calculated using estimated values of vibrational frequencies [ Dorofeeva O.V., 1992]. These later values of S(T) and Cp(T) are 1.0-3.7 J/mol*K larger than selected ones.; GT |
72.25 ± 0.58 | 298.15 | ||
72.67 | 300. | ||
98.53 | 400. | ||
121.23 | 500. | ||
140.02 | 600. | ||
155.40 | 700. | ||
168.12 | 800. | ||
178.85 | 900. | ||
187.91 | 1000. |

Condensed phase thermochemistry data

Data compiled as indicated in comments:
ALS - Hussein Y. Afeefy, Joel F. Liebman, and Stephen E. Stein
DH - Eugene S. Domalski and Elizabeth D. Hearing
Quantity | Value | Units | Method | Reference | Comment |
---|---|---|---|---|---|
ΔfH°liquid | -103.02 ± 0.38 | kJ/mol | Ccr | Steele, Chirico, et al., 1989 | ALS |
Quantity | Value | Units | Method | Reference | Comment |
ΔcH°liquid | -2328.51 ± 0.38 | kJ/mol | Ccr | Steele, Chirico, et al., 1989 | Corresponding ΔfHºliquid = -103.02 kJ/mol (simple calculation by NIST; no Washburn corrections); ALS |
Constant pressure heat capacity of liquid
Cp,liquid (J/mol*K) | Temperature (K) | Reference | Comment |
---|---|---|---|
122.1 | 298.15 | Steele, Chirico, et al., 1989 | DH |

Phase change data

Data compiled as indicated in comments:
BS - Robert L. Brown and Stephen E. Stein
TRC - Thermodynamics Research Center, NIST Boulder Laboratories, Chris Muzny director
ALS - Hussein Y. Afeefy, Joel F. Liebman, and Stephen E. Stein
DRB - Donald R. Burgess, Jr.
AC - William E. Acree, Jr., James S. Chickos
Quantity | Value | Units | Method | Reference | Comment |
---|---|---|---|---|---|
Tboil | 327.7 | K | N/A | Weast and Grasselli, 1989 | BS |
Tboil | 328.15 | K | N/A | Anonymous, 1967 | Uncertainty assigned by TRC = 3. K; TRC |
Quantity | Value | Units | Method | Reference | Comment |
ΔvapH° | 30.77 ± 0.08 | kJ/mol | V | Steele, Chirico, et al., 1989 | ALS |
ΔvapH° | 30.8 | kJ/mol | N/A | Steele, Chirico, et al., 1989 | DRB |
Enthalpy of vaporization
ΔvapH (kJ/mol) | Temperature (K) | Method | Reference | Comment |
---|---|---|---|---|
30.8 ± 0.1 | 300. | EB | Steele, Chirico, et al., 2002 | Based on data from 302. to 260. K.; AC |
28.6 ± 0.3 | 340. | EB | Steele, Chirico, et al., 2002 | Based on data from 302. to 360. K.; AC |

Reaction thermochemistry data

Data compiled by: Hussein Y. Afeefy, Joel F. Liebman, and Stephen E. Stein
Individual Reactions
By formula: C4H6O + H2 = C4H8O
Quantity | Value | Units | Method | Reference | Comment |
---|---|---|---|---|---|
ΔrH° | -107.0 ± 1.3 | kJ/mol | Chyd | Allinger, Glaser, et al., 1981 | liquid phase; solvent: Hexane |

Gas phase ion energetics data

Data evaluated by: Edward P. Hunter and Sharon G. Lias
Quantity | Value | Units | Method | Reference | Comment |
---|---|---|---|---|---|
Proton affinity (review) | 866.9 | kJ/mol | N/A | Hunter and Lias, 1998 | |
Quantity | Value | Units | Method | Reference | Comment |
Gas basicity | 834.4 | kJ/mol | N/A | Hunter and Lias, 1998 |

References

Steele, Chirico, et al., 1989
Steele, W.V.; Chirico, R.D.; Nguyen, A.; Hossenlopp, I.A.; Smith, N.K.,
Determination of some pure compound ideal-gas enthalpies of formation,
AIChE Symp. Ser., 1989, 85, 140-162. [all data]
Klots T.D., 1994
Klots T.D.,
Vibrational assignment and analysis for 2,3-dihydrofuran and 2,5-dihydrofuran,
Spectrochim. Acta, 1994, A50, 1725-1748. [all data]
Dorofeeva O.V., 1992
Dorofeeva O.V.,
Ideal gas thermodynamic properties of oxygen heterocyclic compounds. Part 1. Three-membered, four-membered and five-membered rings,
Thermochim. Acta, 1992, 194, 9-46. [all data]
Weast and Grasselli, 1989
CRC Handbook of Data on Organic Compounds, 2nd Editon, Weast,R.C and Grasselli, J.G., ed(s)., CRC Press, Inc., Boca Raton, FL, 1989, 1. [all data]
Anonymous, 1967
Anonymous, P.,
, 1967. [all data]
Steele, Chirico, et al., 2002
Steele, W.V.; Chirico, R.D.; Knipmeyer, S.E.; Nguyen, A.,
Measurements of Vapor Pressure, Heat Capacity, and Density along the Saturation Line for Cyclopropane Carboxylic Acid, N , N -Diethylethanolamine, 2,3-Dihydrofuran, 5-Hexen-2-one, Perfluorobutanoic Acid, and 2-Phenylpropionaldehyde,
J. Chem. Eng. Data, 2002, 47, 4, 715-724, https://doi.org/10.1021/je010087j
. [all data]
Allinger, Glaser, et al., 1981
Allinger, N.L.; Glaser, J.A.; Davis, H.E.,
Heats of hydrogenation of some vinyl ethers and related compounds,
J. Org. Chem., 1981, 46, 658-661. [all data]
Hunter and Lias, 1998
Hunter, E.P.; Lias, S.G.,
Evaluated Gas Phase Basicities and Proton Affinities of Molecules: An Update,
J. Phys. Chem. Ref. Data, 1998, 27, 3, 413-656, https://doi.org/10.1063/1.556018
. [all data]