CAS Reg. No. 119177-55-8
- CAS Registry Number: 119177-55-8

Reaction thermochemistry data

Data compiled by: John E. Bartmess
Individual Reactions
(CAS Reg. No. 119177-55-8 • 4294967295) +
= CAS Reg. No. 119177-55-8
By formula: (CAS Reg. No. 119177-55-8 • 4294967295Pt) + Pt = CAS Reg. No. 119177-55-8
Quantity | Value | Units | Method | Reference | Comment |
---|---|---|---|---|---|
ΔrH° | 422. ± 41. | kJ/mol | N/A | Ervin, Ho, et al., 1988 | gas phase |

References

Ervin, Ho, et al., 1988
Ervin, K.M.; Ho, J.; Lineberger, W.C.,
Electronic and Vibrational Structure of Transition Metal Trimers: Photoelectron Spectra of Ni3-, Pd3- and Pt3-,
J. Chem. Phys., 1988, 89, 8, 4514, https://doi.org/10.1063/1.454791
. [all data]