Disperse Yellow 1
- Formula: C12H9N3O5
- Molecular weight: 275.2170
- IUPAC Standard InChIKey: BCPQALWAROJVLE-UHFFFAOYSA-N
- CAS Registry Number: 119-15-3
- Chemical structure:
View 3d structure (requires JavaScript / HTML 5) - Other names: Phenol, 4-[(2,4-dinitrophenyl)amino]-; Phenol, p-(2,4-dinitroanilino)-; Acetamine Yellow 2R; Acetoquinone Light Yellow 2RZ; Amacel Yellow RR; C.I. Disperse Yellow 1; C.I. 10345; Celliton Fast Yellow RR; Celliton Fast Yellow RRA-CF; Cilla Fast Yellow RR; Disperse Fast Yellow 2K; Disperse Yellow R; Dispersol Fast Yellow A; Dispersol Printing Yellow A; Fast Disperse Yellow 2K; Fenacet Fast Yellow 2R; Kayalon Fast Yellow RR; Microsetile Yellow 2R; N-2,4-Dinitrophenyl-4-aminophenol; Nyloquinone Yellow 2R; Perliton Yellow RR; Reliton Yellow R; Serisol Fast Yellow A; Setacyl Yellow P-BS; Supracet Fast Yellow 2R; Supracet Yellow RR; SRA Golden Yellow VIII; 2,4-Dinitro-4'-hydroxydiphenylamine; 4-(2,4-Dinitroanilino)phenol; 4-[(2,4-Dinitrophenyl)amino]phenol; 4-Hydroxy-2',4'-dinitrodiphenylamine; 4'-Hydroxy-2,4-dinitrodiphenylamine; p-(2,4-Dinitroanilino)phenol; Permanent Yellow 2K; C.I. Solvent Yellow 52; 2,4-Dinitro-p-hydroxydiphenylamine; Dispersol yellow B-A; Disperse yellow stable 2K; Synten yellow P 2R; N-(2,4-Dinitrophenyl)-N-(4-hydroxyphenyl)amine; NSC 13965

Phase change data

Data compiled by: William E. Acree, Jr., James S. Chickos
Enthalpy of sublimation
ΔsubH (kJ/mol) | Temperature (K) | Method | Reference | Comment |
---|---|---|---|---|
155.6 ± 4.2 | 455. | TE,ME | Kojima, 1970 | Based on data from 440. to 470. K. See also Stephenson and Malanowski, 1987. |

References

Kojima, 1970
Kojima, H.,
Sen'i Gakkaishi, 1970, 26, 530. [all data]
Stephenson and Malanowski, 1987
Stephenson, Richard M.; Malanowski, Stanislaw,
Handbook of the Thermodynamics of Organic Compounds, 1987, https://doi.org/10.1007/978-94-009-3173-2
. [all data]
Lang (editor), 1967
Lang (editor), L.,
Absorption Spectra in the Ultraviolet and Visible Region, 1967, 8, 85. [all data]