1,6-Hexanedithiol
- Formula: C6H14S2
- Molecular weight: 150.305
- IUPAC Standard InChIKey: SRZXCOWFGPICGA-UHFFFAOYSA-N
- CAS Registry Number: 1191-43-1
- Chemical structure:
View 3d structure (requires JavaScript / HTML 5) - Other names: 1,6-Dimercaptohexane; 1,6-Hexanedimercaptan; Hexanedithiol-(1,6); USAF uctl-72; NDR-139; 6-Sulfanylhexan-1-thiol; hexane-1,6-dithiol

Phase change data

Data compiled as indicated in comments:
BS - Robert L. Brown and Stephen E. Stein
AC - William E. Acree, Jr., James S. Chickos
Reduced pressure boiling point
Tboil (K) | Pressure (bar) | Reference | Comment |
---|---|---|---|
391.7 | 0.020 | Weast and Grasselli, 1989 | BS |
Enthalpy of vaporization
ΔvapH (kJ/mol) | Temperature (K) | Method | Reference | Comment |
---|---|---|---|---|
55.7 | 394. | A | Stephenson and Malanowski, 1987 | Based on data from 379. to 511. K. See also Dykyj, Svoboda, et al., 1999.; AC |

Kovats' RI, non-polar column, isothermal

View large format table.

Column type Active phase Temperature (C) I Reference Comment
PackedApiezon M130.1270.Garbuzov, Misharina, et al., 1985He or N2, Chromosorb W, AW-DMCS; Column length: 2.1 m
PackedOV-101130.1255.Zygmunt, Wardencki, et al., 1983Ar, Gas-Chrom Q; Column length: 1.5 m
PackedOV-101130.1258.Zygmunt, Wardencki, et al., 1983Ar, Gas-Chrom Q; Column length: 1.5 m

Kovats' RI, non-polar column, custom temperature program

View large format table.

Column type Active phase I Reference Comment
CapillaryApiezon M1270.Zhu, Wang, et al., 2007Program: not specified

Kovats' RI, polar column, custom temperature program

View large format table.

Column type Active phase I Reference Comment
CapillaryPEG-20M1770.Zhu, Wang, et al., 2007Program: not specified

References

Weast and Grasselli, 1989
CRC Handbook of Data on Organic Compounds, 2nd Editon, Weast,R.C and Grasselli, J.G., ed(s)., CRC Press, Inc., Boca Raton, FL, 1989, 1. [all data]
Stephenson and Malanowski, 1987
Stephenson, Richard M.; Malanowski, Stanislaw,
Handbook of the Thermodynamics of Organic Compounds, 1987, https://doi.org/10.1007/978-94-009-3173-2
. [all data]
Dykyj, Svoboda, et al., 1999
Dykyj, J.; Svoboda, J.; Wilhoit, R.C.; Frenkel, M.L.; Hall, K.R.,
Vapor Pressure of Chemicals: Part A. Vapor Pressure and Antoine Constants for Hydrocarbons and Sulfur, Selenium, Tellurium and Hydrogen Containing Organic Compounds, Springer, Berlin, 1999, 373. [all data]