Hexanoic acid, 6-hydroxy-
- Formula: C6H12O3
- Molecular weight: 132.1577
- IUPAC Standard InChIKey: IWHLYPDWHHPVAA-UHFFFAOYSA-N
- CAS Registry Number: 1191-25-9
- Chemical structure:
View 3d structure (requires JavaScript / HTML 5) - Other names: 6-Hydroxycaproic acid; 6-Hydroxyhexanoic acid

Condensed phase thermochemistry data

Data compiled by: Hussein Y. Afeefy, Joel F. Liebman, and Stephen E. Stein
Quantity | Value | Units | Method | Reference | Comment |
---|---|---|---|---|---|
ΔfH°solid | -786. ± 3. | kJ/mol | Cm | Wiberg and Waldron, 1991 |

Reaction thermochemistry data

Data compiled by: Hussein Y. Afeefy, Joel F. Liebman, and Stephen E. Stein
Individual Reactions
By formula: C6H12O3 = C6H10O2 + H2O
Quantity | Value | Units | Method | Reference | Comment |
---|---|---|---|---|---|
ΔrH° | 15.5 ± 0.3 | kJ/mol | Cm | Wiberg and Waldron, 1991 | solid phase |

References

Wiberg and Waldron, 1991
Wiberg, K.B.; Waldron, R.F.,
Lactones. 2. Enthalpies of hydrolysis, reduction, and formation of the C4-C13 monocyclic lactones. strain energies and conformations,
J. Am. Chem. Soc., 1991, 113, 7697-7705. [all data]