diisobutylaluminium hydride
- Formula: C8H19Al
- Molecular weight: 142.2180
- IUPAC Standard InChIKey: AZWXAPCAJCYGIA-UHFFFAOYSA-N
- CAS Registry Number: 1191-15-7
- Chemical structure:
View 3d structure (requires JavaScript / HTML 5) - Other names: Diisobutylaluminum hydride

Gas phase thermochemistry data

Data compiled by: José A. Martinho Simões
Quantity | Value | Units | Method | Reference | Comment |
---|---|---|---|---|---|
ΔfH°gas | -360. ± 17. | kJ/mol | Review | Martinho Simões | |
ΔfH°gas | -247.0 ± 4.9 | kJ/mol | Review | Martinho Simões |

Condensed phase thermochemistry data

Data compiled as indicated in comments:
MS - José A. Martinho Simões
DH - Eugene S. Domalski and Elizabeth D. Hearing
Quantity | Value | Units | Method | Reference | Comment |
---|---|---|---|---|---|
ΔfH°liquid | -402. ± 16. | kJ/mol | Review | Martinho Simões | MS |
ΔfH°liquid | -289.3 ± 4.4 | kJ/mol | Review | Martinho Simões | MS |
Quantity | Value | Units | Method | Reference | Comment |
ΔcH°liquid | -6412.0 ± 4.2 | kJ/mol | CC-SB | Pawlenko, 1967 | Please also see Pedley and Rylance, 1977 and Cox and Pilcher, 1970.; MS |
ΔcH°liquid | -6299. ± 16. | kJ/mol | CC-SB | Shaulov, Shmyreva, et al., 1965 | Please also see Cox and Pilcher, 1970.; MS |
Quantity | Value | Units | Method | Reference | Comment |
S°liquid | 347.0 | J/mol*K | N/A | Sheiman, Rabinovich, et al., 1991 | DH |
Constant pressure heat capacity of liquid
Cp,liquid (J/mol*K) | Temperature (K) | Reference | Comment |
---|---|---|---|
321.7 | 298.15 | Sheiman, Rabinovich, et al., 1991 | T = 5 to 303 K.; DH |

Phase change data

Data compiled by: José A. Martinho Simões
Quantity | Value | Units | Method | Reference | Comment |
---|---|---|---|---|---|
ΔvapH° | 42.3 ± 2.1 | kJ/mol | CC-SB | Shaulov, Shmyreva, et al., 1965 | Please also see Cox and Pilcher, 1970. |

References

Martinho Simões
Martinho Simões, J.A.,
Private communication (see http://webbook.nist.gov/chemistry/om/). [all data]
Pawlenko, 1967
Pawlenko, S.,
Chem. Ber., 1967, 100, 3591. [all data]
Pedley and Rylance, 1977
Pedley, J.B.; Rylance, J.,
Computer Analysed Thermochemical Data: Organic and Organometallic Compounds, University of Sussex, Brigton, 1977. [all data]
Cox and Pilcher, 1970
Cox, J.D.; Pilcher, G.,
Thermochemistry of Organic and Organometallic Compounds
in Academic Press, New York, 1970. [all data]
Shaulov, Shmyreva, et al., 1965
Shaulov, Yu.Kh.; Shmyreva, G.O.; Tubyanskaya, V.S.,
Russ. J. Phys. Chem., 1965, 39, 51. [all data]
Sheiman, Rabinovich, et al., 1991
Sheiman, M.S.; Rabinovich, I.B.; Nistratov, V.P.; Smirnova, N.N.; Kamelova, G.P.; Klimov, K.N.; Zorin, A.D.,
Low temperature heat capacity and thermodynamic functions of tripropylaluminum and diisobutylaluminum,
Zhur. Fiz. Khim., 1991, 65(3), 831-836. [all data]