Heptane, 2,2,6-trimethyl-
- Formula: C10H22
- Molecular weight: 142.2817
- IUPAC Standard InChIKey: FHJCGIUZJXWNET-UHFFFAOYSA-N
- CAS Registry Number: 1190-83-6
- Chemical structure:
View 3d structure (requires JavaScript / HTML 5) - Other names: 2,2,6-Trimethylheptane

Phase change data

Data compiled as indicated in comments:
TRC - Thermodynamics Research Center, NIST Boulder Laboratories, Chris Muzny director
AC - William E. Acree, Jr., James S. Chickos
Quantity | Value | Units | Method | Reference | Comment |
---|---|---|---|---|---|
Tboil | 421.15 | K | N/A | Marschner and Carmody, 1951 | Uncertainty assigned by TRC = 3. K; TRC |
Tboil | 421.65 | K | N/A | Marschner and Carmody, 1951 | Uncertainty assigned by TRC = 3. K; TRC |
Tboil | 421.15 | K | N/A | Marschner and Carmody, 1951 | Uncertainty assigned by TRC = 3. K; TRC |
Tboil | 421.35 | K | N/A | Fenske, Braun, et al., 1947 | Uncertainty assigned by TRC = 1.5 K; TRC |
Tboil | 422.08 | K | N/A | Brooks, Cleaton, et al., 1937 | Uncertainty assigned by TRC = 0.4 K; TRC |
Quantity | Value | Units | Method | Reference | Comment |
Tfus | 168.15 | K | N/A | Brooks, Cleaton, et al., 1937 | Uncertainty assigned by TRC = 1. K; TRC |
Quantity | Value | Units | Method | Reference | Comment |
ΔvapH° | 46.4 | kJ/mol | N/A | Reid, 1972 | AC |

Kovats' RI, non-polar column, isothermal

View large format table.

Column type Active phase Temperature (C) I Reference Comment
CapillarySqualane100.873.Heinzen, Soares, et al., 1999
CapillarySqualane60.873.Chretien and Dubois, 1976
CapillarySqualane60.873.Matukuma, 1969N2; Column length: 91.4 m; Column diameter: 0.25 mm

Kovats' RI, non-polar column, custom temperature program

View large format table.

Column type Active phase I Reference Comment
CapillarySqualane872.Korol and Lysyuk, 1980Program: not specified

Normal alkane RI, non-polar column, isothermal

View large format table.

Column type Active phase Temperature (C) I Reference Comment
CapillaryMethyl Silicone50.872.N/AN2; Column length: 74.6 m; Column diameter: 0.28 mm

Normal alkane RI, non-polar column, custom temperature program

View large format table.

Column type Active phase I Reference Comment
CapillaryOV-101873.Du and Liang, 2003Program: not specified
CapillaryPolydimethyl siloxane873.Junkes, Castanho, et al., 2003Program: not specified

References

Marschner and Carmody, 1951
Marschner, R.F.; Carmody, D.R.,
React. of Isoalkane and Olefin Percursors Catalyzed by Sulfuric Acid,
J. Am. Chem. Soc., 1951, 73, 604. [all data]
Fenske, Braun, et al., 1947
Fenske, M.R.; Braun, W.G.; Wiegand, R.V.; Quiggle, D.; McCormick, R.H.; Rank, D.H.,
Raman Spectra of Hydrocarbons,
Anal. Chem., 1947, 19, 700. [all data]
Brooks, Cleaton, et al., 1937
Brooks, D.B.; Cleaton, R.B.; Carter, F.R.,
Paraffin Hydrocarbons Isolated from Crude Synthetic Isooctane (2,2,4-Trimethylpentane),
J. Res. Natl. Bur. Stand. (U. S.), 1937, 19, 319. [all data]
Reid, 1972
Reid, Robert C.,
Handbook on vapor pressure and heats of vaporization of hydrocarbons and related compounds, R. C. Wilhort and B. J. Zwolinski, Texas A Research Foundation. College Station, Texas(1971). 329 pages.$10.00,
AIChE J., 1972, 18, 6, 1278-1278, https://doi.org/10.1002/aic.690180637
. [all data]