Heptane, 2,5,5-trimethyl-
- Formula: C10H22
- Molecular weight: 142.2817
- IUPAC Standard InChIKey: SOYLPZSOEXZMLE-UHFFFAOYSA-N
- CAS Registry Number: 1189-99-7
- Chemical structure:
View 3d structure (requires JavaScript / HTML 5) - Other names: 2,5,5-Trimethylheptane

Phase change data

Data compiled as indicated in comments:
TRC - Thermodynamics Research Center, NIST Boulder Laboratories, Chris Muzny director
AC - William E. Acree, Jr., James S. Chickos
Quantity | Value | Units | Method | Reference | Comment |
---|---|---|---|---|---|
Tboil | 425.95 | K | N/A | Boord, Greenlee, et al., 1947 | Uncertainty assigned by TRC = 0.5 K; TRC |
Quantity | Value | Units | Method | Reference | Comment |
ΔvapH° | 46.0 | kJ/mol | N/A | Reid, 1972 | AC |

Kovats' RI, non-polar column, isothermal

View large format table.

Column type Active phase Temperature (C) I Reference Comment
CapillarySqualane100.892.Heinzen, Soares, et al., 1999
CapillarySqualane60.891.7Chretien and Dubois, 1976
CapillarySqualane60.892.Matukuma, 1969N2; Column length: 91.4 m; Column diameter: 0.25 mm

Kovats' RI, non-polar column, custom temperature program

View large format table.

Column type Active phase I Reference Comment
CapillarySqualane890.Korol and Lysyuk, 1980Program: not specified

Normal alkane RI, non-polar column, custom temperature program

View large format table.

Column type Active phase I Reference Comment
CapillaryOV-101892.Du and Liang, 2003Program: not specified
CapillaryPolydimethyl siloxane892.Junkes, Castanho, et al., 2003Program: not specified

References

Boord, Greenlee, et al., 1947
Boord, C.E.; Greenlee, K.W.; Perilstein, W.L.; Derfer, J.M.,
The Synthesis, Purification and Prop. of Hydrocarbons of Low Mol. Wt., Am. Pet. Inst. Res. Proj. 45, Ninth Annu. Rep., Ohio State Univ., June 30, 1947. [all data]
Reid, 1972
Reid, Robert C.,
Handbook on vapor pressure and heats of vaporization of hydrocarbons and related compounds, R. C. Wilhort and B. J. Zwolinski, Texas A Research Foundation. College Station, Texas(1971). 329 pages.$10.00,
AIChE J., 1972, 18, 6, 1278-1278, https://doi.org/10.1002/aic.690180637
. [all data]