Benzoic acid, 2-amino-
- Formula: C7H7NO2
- Molecular weight: 137.1360
- IUPAC Standard InChIKey: RWZYAGGXGHYGMB-UHFFFAOYSA-N
- CAS Registry Number: 118-92-3
- Chemical structure:
View 3d structure (requires JavaScript / HTML 5) - Other names: Anthranilic acid; o-Aminobenzoic acid; o-Carboxyaniline; 2-Aminobenzoic acid; 2-Carboxyaniline; NCI-C01730; 1-Amino-2-carboxybenzene; o-Anthranilic acid; Benzoic acid, o-amino-; Kyselina o-aminobenzoova; Kyselina anthranilova; ortho-Aminobenzoic acid; Vitamin L1; NSC 144

Gas phase thermochemistry data

Data compiled by: Hussein Y. Afeefy, Joel F. Liebman, and Stephen E. Stein
Quantity | Value | Units | Method | Reference | Comment |
---|---|---|---|---|---|
ΔfH°gas | -296.2 ± 1.6 | kJ/mol | Ccr | Nabavian, Sabbah, et al., 1977 | Author was aware that data differs from previously reported values |

Condensed phase thermochemistry data

Data compiled as indicated in comments:
ALS - Hussein Y. Afeefy, Joel F. Liebman, and Stephen E. Stein
DH - Eugene S. Domalski and Elizabeth D. Hearing
Quantity | Value | Units | Method | Reference | Comment |
---|---|---|---|---|---|
ΔfH°solid | -401.1 ± 1.2 | kJ/mol | Ccr | Nabavian, Sabbah, et al., 1977 | Author was aware that data differs from previously reported values; ALS |
ΔfH°solid | -401. ± 0.8 | kJ/mol | Ccb | Lebedeva, Gutner, et al., 1971 | Hfusion=4.9±0.1, see Lebedeva, Rjadnenko, et al., 1969; ALS |
Quantity | Value | Units | Method | Reference | Comment |
ΔcH°solid | -3353.83 ± 0.80 | kJ/mol | Ccr | Nabavian, Sabbah, et al., 1977 | Author was aware that data differs from previously reported values; ALS |
ΔcH°solid | -3354. ± 0.8 | kJ/mol | Ccb | Lebedeva, Gutner, et al., 1971 | Hfusion=4.9±0.1, see Lebedeva, Rjadnenko, et al., 1969; ALS |
Constant pressure heat capacity of solid
Cp,solid (J/mol*K) | Temperature (K) | Reference | Comment |
---|---|---|---|
187.0 | 323. | Satoh and Sogabe, 1941 | T = 0 to 100 C. Mean value.; DH |
165.3 | 298. | Andrews, Lynn, et al., 1926 | T = 22 to 160 C.; DH |

Phase change data

Data compiled as indicated in comments:
TRC - Thermodynamics Research Center, NIST Boulder Laboratories, Chris Muzny director
ALS - Hussein Y. Afeefy, Joel F. Liebman, and Stephen E. Stein
AC - William E. Acree, Jr., James S. Chickos
DH - Eugene S. Domalski and Elizabeth D. Hearing
Quantity | Value | Units | Method | Reference | Comment |
---|---|---|---|---|---|
Tfus | 417.8 | K | N/A | Andrews, Lynn, et al., 1926, 2 | Uncertainty assigned by TRC = 0.5 K; with possible decomposition; TRC |
Quantity | Value | Units | Method | Reference | Comment |
ΔsubH° | 104.9 ± 1.0 | kJ/mol | V | Nabavian, Sabbah, et al., 1977 | Author was aware that data differs from previously reported values; ALS |
ΔsubH° | 104.9 ± 1.0 | kJ/mol | V | Sabbah, Chastelet, et al., 1974 | ALS |
ΔsubH° | 111.6 ± 1.7 | kJ/mol | N/A | Arnold and Jones, 1972 | AC |
Enthalpy of fusion
ΔfusH (kJ/mol) | Temperature (K) | Reference | Comment |
---|---|---|---|
20.5 | 417.8 | Acree, 1991 | AC |
20.380 | 417.8 | Andrews, Lynn, et al., 1926 | DH |
Entropy of fusion
ΔfusS (J/mol*K) | Temperature (K) | Reference | Comment |
---|---|---|---|
48.8 | 417.8 | Andrews, Lynn, et al., 1926 | DH |

Reaction thermochemistry data

Data compiled by: John E. Bartmess
Individual Reactions
C7H6NO2- + =
By formula: C7H6NO2- + H+ = C7H7NO2
Quantity | Value | Units | Method | Reference | Comment |
---|---|---|---|---|---|
ΔrH° | 337.3 ± 2.2 | kcal/mol | G+TS | Kebarle and McMahon, 1977 | gas phase |
Quantity | Value | Units | Method | Reference | Comment |
ΔrG° | 330.2 ± 2.0 | kcal/mol | IMRE | Kebarle and McMahon, 1977 | gas phase |

Gas phase ion energetics data

Data evaluated as indicated in comments:
HL - Edward P. Hunter and Sharon G. Lias
Data compiled as indicated in comments:
B - John E. Bartmess
LLK - Sharon G. Lias, Rhoda D. Levin, and Sherif A. Kafafi
RDSH - Henry M. Rosenstock, Keith Draxl, Bruce W. Steiner, and John T. Herron
Quantity | Value | Units | Method | Reference | Comment |
---|---|---|---|---|---|
Proton affinity (review) | 215.5 | kcal/mol | N/A | Hunter and Lias, 1998 | HL |
Quantity | Value | Units | Method | Reference | Comment |
Gas basicity | 207.7 | kcal/mol | N/A | Hunter and Lias, 1998 | HL |
Ionization energy determinations
IE (eV) | Method | Reference | Comment |
---|---|---|---|
7.6 | PE | Meeks, Wahlborg, et al., 1981 | LLK |
8.29 | CTS | Slifkin and Allison, 1967 | RDSH |
8.0 | PE | Meeks, Wahlborg, et al., 1981 | Vertical value; LLK |
De-protonation reactions
C7H6NO2- + =
By formula: C7H6NO2- + H+ = C7H7NO2
Quantity | Value | Units | Method | Reference | Comment |
---|---|---|---|---|---|
ΔrH° | 337.3 ± 2.2 | kcal/mol | G+TS | Kebarle and McMahon, 1977 | gas phase; B |
Quantity | Value | Units | Method | Reference | Comment |
ΔrG° | 330.2 ± 2.0 | kcal/mol | IMRE | Kebarle and McMahon, 1977 | gas phase; B |

Van Den Dool and Kratz RI, non-polar column, custom temperature program

Column type | Active phase | I | Reference | Comment |
---|---|---|---|---|
Capillary | VF-5MS | 1413.1 | Tret'yakov, 2007 | 30. m/0.25 mm/0.25 μm, He; Program: Multi-step temperature program; T(initial)=60C; T(final)=270C |

Normal alkane RI, non-polar column, temperature ramp

Column type | Active phase | I | Reference | Comment |
---|---|---|---|---|
Capillary | HP-5 MS | 1416. | Jerkovic, Hegic, et al., 2010 | 30. m/0.25 mm/0.25 μm, Helium, 70. C @ 2. min, 3. K/min, 200. C @ 18. min |

Normal alkane RI, polar column, temperature ramp

Column type | Active phase | I | Reference | Comment |
---|---|---|---|---|
Capillary | DB-Wax | 2997. | Parada and Duque, 1998 | 30. m/0.25 mm/0.25 μm, He, 50. C @ 3. min, 4. K/min, 240. C @ 10. min |
Capillary | DB-Wax | 3021. | Parada and Duque, 1998 | 30. m/0.25 mm/0.25 μm, He, 50. C @ 3. min, 4. K/min, 240. C @ 10. min |

References

Nabavian, Sabbah, et al., 1977
Nabavian, P.M.; Sabbah, R.; Chastel, R.; Laffitte, M.,
Thermodynamique de composes azotes. II. Etude thermochimique des acides aminobenzoiques, de la pyrimidine, de l'uracile et de la thymine.,
J. Chim. Phys., 1977, 74, 115-126. [all data]
Lebedeva, Gutner, et al., 1971
Lebedeva, N.D.; Gutner, N.M.; Ryadnenko, V.L.,
Heats of combustion and formation of certain aromatic amino-derivatives,
Russ. J. Phys. Chem. (Engl. Transl.), 1971, 45, 561-562. [all data]
Lebedeva, Rjadnenko, et al., 1969
Lebedeva, N.D.; Rjadnenko, B.L.; Gutner, N.M.,
Heats of formation of some N-containing organic compounds,
Int. Conf. Calorim. Therm. (Warsaw, Poland), 1969, 1-8. [all data]
Satoh and Sogabe, 1941
Satoh, S.; Sogabe, T.,
The heat capacities of some organic compounds containing nitrogen and the atomic heat of nitrogen. (2), Sci.,
Pap. Inst. Phys. Chem. Res. (Tokyo), 1941, 38, 231-237. [all data]
Andrews, Lynn, et al., 1926
Andrews, D.H.; Lynn, G.; Johnston, J.,
The heat capacities and heat of crystallization of some isomeric aromatic compounds,
J. Am. Chem. Soc., 1926, 48, 1274-1287. [all data]
Andrews, Lynn, et al., 1926, 2
Andrews, D.H.; Lynn, G.; Johnston, J.,
The Heat Capacities and Heat of Crystallization of Some Isomeric Aromatic Compounds,
J. Am. Chem. Soc., 1926, 48, 1274. [all data]
Sabbah, Chastelet, et al., 1974
Sabbah, R.; Chastelet, R.; Laffitte, M.,
Thermodynamic de composès azotes. I. Etude calorimètrique des enthalpies de sublimation des trios acides aminobenzoïques,
Can. J. Chem., 1974, 52, 2201. [all data]
Arnold and Jones, 1972
Arnold, P.R.; Jones, F.,
Polymorphism in Anthranilic Acid Crystals---Examination by DTA and DSC,
Molecular Crystals and Liquid Crystals, 1972, 19, 2, 133-140, https://doi.org/10.1080/15421407208083859
. [all data]
Acree, 1991
Acree, William E.,
Thermodynamic properties of organic compounds: enthalpy of fusion and melting point temperature compilation,
Thermochimica Acta, 1991, 189, 1, 37-56, https://doi.org/10.1016/0040-6031(91)87098-H
. [all data]